{"text_format":"1","workbook":"xlsx","n_sheets":34,"sheets":["START","Instructions","Template names","Lookup and lists","Org structure","Contacts","C1-Sum","C2-FinPerf SC","C2C","C3-FinPerf V","C3C","C4-FinPerf RE","C5-Capex","C5C","C6-FinPos","C7-CFlow","SC1","SC2","SC3","SC4","SC5","SC6","SC7","SC8","SC9","SC10","SC11","SC12","SC13a","SC13b","SC13c","SC13d","SC13e","SC71charts"],"not_rendered":{"charts":5,"images":17,"macros":1,"external_links":5,"defined_names":1872,"comments":0,"pivot_tables":0},"unopened":[],"bounds":{"document_bytes":16777216,"sheet_cells":100000,"rows_first":2000,"rows_last":500,"rows_between":2000,"halvings":0,"cell_chars":16384,"cell_head_chars":4096},"cells_cut":0,"cells_raw":0,"read":"whole","date_system":"1900"}

{"sheet":"START","index":0,"n_rows":1,"n_cols":1,"rows_kept":1,"cut":false,"hidden":false,"merged":[]}
[{"$f":"muni","v":"LIM331 Greater Giyani"}]

{"sheet":"Instructions","index":1,"n_rows":55,"n_cols":25,"rows_kept":55,"cut":false,"hidden":false,"merged":[]}
[]
[null,null,null,2020]
[]
[null,null,null,null,null,null,null,null,null,null,null,null,null,null,null,null,null,null,null,null,null,null,null,"Yes"]
[null,null,null,null,null,null,null,null,null,null,null,null,null,null,null,null,null,null,null,null,null,null,null,"No"]
[]
[null,null,null,null,null,null,null,null,null,null,null,null,null,null,null,null,null,null,null,null,null,null,"Type of Entities Range:","Parent Municipality"]
[null,null,null,null,null,null,null,null,null,null,null,null,null,null,null,null,null,null,null,null,null,null,null,"Consolidated Information"]
[]
[null,null,null,null,null,null,null,null,null,null,null,null,null,null,null,null,null,null,null,null,null,null,"Date linked",1]
[null,null,null,null,null,null,null,null,null,null,null,null,null,null,null,null,null,null,null,null,null,null,"Date",{"$f":"VLOOKUP(X10,W39:X55,2)","v":"M01 July"},"2013-08-01"]
[]
[]
[]
[]
[]
[]
[]
[null,null,null,null,null,null,null,null,null,null,null,null,null,null,null,null,null,null,null,null,null,null,"MTREF Range:",2008]
[null,null,null,null,null,null,null,null,null,null,null,null,null,null,null,null,null,null,null,null,null,null,null,2009]
[null,null,null,null,null,null,null,null,null,null,null,null,null,null,null,null,null,null,null,null,null,null,null,2010]
[null,null,null,null,null,null,null,null,null,null,null,null,null,null,null,null,null,null,null,null,null,null,null,2011]
[null,null,null,null,null,null,null,null,null,null,null,null,null,null,null,null,null,null,null,null,null,null,null,2012]
[null,null,null,null,null,null,null,null,null,null,null,null,null,null,null,null,null,null,null,null,null,null,null,2013]
[null,null,null,null,null,null,null,null,null,null,null,null,null,null,null,null,null,null,null,null,null,null,null,2014]
[null,null,null,null,null,null,null,null,null,null,null,null,null,null,null,null,null,null,null,null,null,null,null,2015]
[null,null,null,null,null,null,null,null,null,null,null,null,null,null,null,null,null,null,null,null,null,null,null,2016]
[null,null,null,null,null,null,null,null,null,null,null,null,null,null,null,null,null,null,null,null,null,null,null,2017]
[null,null,null,null,null,null,null,null,null,null,null,null,null,null,null,null,null,null,null,null,null,null,null,2018]
[null,null,null,null,null,null,null,null,null,null,null,null,null,null,null,null,null,null,null,null,null,null,null,2019]
[null,null,null,null,null,null,null,null,null,null,null,null,null,null,null,null,null,null,null,null,null,null,null,2020]
[null,null,null,null,null,null,null,null,null,null,null,null,null,null,null,null,null,null,null,null,null,null,null,2021]
[null,null,null,null,null,null,null,null,null,null,null,null,null,null,null,null,null,null,null,null,null,null,null,2022]
[null,null,null,null,null,null,null,null,null,null,null,null,null,null,null,null,null,null,null,null,null,null,"MTREF Linked:"]
[null,null,null,null,null,null,null,null,null,null,null,null,null,null,null,null,null,null,null,null,null,null,"MTREF:",12]
[null,null,null,null,null,null,null,null,null,null,null,null,null,null,null,null,null,null,null,null,null,null,null,{"$f":"INDEX(X19:X33,X35,1)","v":2019}]
[null,null,null,null,null,null,null,null,null,null,null,null,null,null,null,null,null,null,null,null,null,null,"Fin Year:"]
[null,null,null,null,null,null,null,null,null,null,null,null,null,null,null,null,null,null,null,null,null,null,null,{"$f":"MTREF&\"/\"&RIGHT(MTREF,2)+1","v":"2019/20"}]
[null,null,null,null,null,null,null,null,null,null,null,null,null,null,null,null,null,null,null,null,null,"Date/type of report",1,"M01 July"]
[null,null,null,null,null,null,null,null,null,null,null,null,null,null,null,null,null,null,null,null,null,null,2,"M02 August"]
[null,null,null,null,null,null,null,null,null,null,null,null,null,null,null,null,null,null,null,null,null,null,3,"M03 September"]
[null,null,null,null,null,null,null,null,null,null,null,null,null,null,null,null,null,null,null,null,null,null,4,"M04 October"]
[null,null,null,null,null,null,null,null,null,null,null,null,null,null,null,null,null,null,null,null,null,null,5,"M05 November"]
[null,null,null,null,null,null,null,null,null,null,null,null,null,null,null,null,null,null,null,null,null,null,6,"M06 December"]
[null,null,null,null,null,null,null,null,null,null,null,null,null,null,null,null,null,null,null,null,null,null,7,"M07 January"]
[null,null,null,null,null,null,null,null,null,null,null,null,null,null,null,null,null,null,null,null,null,null,8,"M08 February"]
[null,null,null,null,null,null,null,null,null,null,null,null,null,null,null,null,null,null,null,null,null,null,9,"M09 March"]
[null,null,null,null,null,null,null,null,null,null,null,null,null,null,null,null,null,null,null,null,null,null,10,"M10 April"]
[null,null,null,null,null,null,null,null,null,null,null,null,null,null,null,null,null,null,null,null,null,null,11,"M11 May"]
[null,null,null,null,null,null,null,null,null,null,null,null,null,null,null,null,null,null,null,null,null,null,12,"M12 June"]
[null,null,null,null,null,null,null,null,null,null,null,null,null,null,null,null,null,null,null,null,null,null,13,"Q1 First Quarter"]
[null,null,null,null,null,null,null,null,null,null,null,null,null,null,null,null,null,null,null,null,null,null,14,"Q2 Second Quarter"]
[null,null,null,null,null,null,null,null,null,null,null,null,null,null,null,null,null,null,null,null,null,null,15,"Q3 Third Quarter"]
[null,null,null,null,null,null,null,null,null,null,null,null,null,null,null,null,null,null,null,null,null,null,16,"Q4 Fourth Quarter"]
[null,null,null,null,null,null,null,null,null,null,null,null,null,null,null,null,null,null,null,null,null,null,17,"Mid-Year Assessment"]

{"sheet":"Template names","index":2,"n_rows":107,"n_cols":6,"rows_kept":107,"cut":false,"hidden":true,"merged":[[0,0,0,3],[75,0,75,1],[71,0,71,3]]}
["Common sheet headings"]
["Head1",{"$f":"HLOOKUP(MTREF,Headings,2)","v":"2018/19"},"Prior year -1"]
["Head2",{"$f":"HLOOKUP(MTREF,Headings,5)","v":"Budget Year 2019/20"},"Year of approved budget"]
["Head2A",{"$f":"HLOOKUP(MTREF,Headings,4)","v":"2019/20"},"Approved budget year"]
["Head3",{"$f":"HLOOKUP(MTREF,Headings,3)","v":"2019/20 Medium Term Revenue & Expenditure Framework"},"MTREF header name"]
["Head5","Audited Outcome"]
["Head5A","Outcome"]
["Head5B","Pre-audit outcome"]
["Head6","Original Budget"]
["Head7","Adjusted Budget"]
["Head8","Full Year Forecast"]
["Head9",{"$f":"HLOOKUP(MTREF,Headings,5)","v":"Budget Year 2019/20"},"1st year of MTREF","Year1"]
["Head10",{"$f":"HLOOKUP(MTREF,Headings,6)","v":"Budget Year +1 2020/21"},"2nd year of MTREF","Year2"]
["Head11",{"$f":"HLOOKUP(MTREF,Headings,7)","v":"Budget Year +2 2021/22"},"3rd year of MTREF","Year3"]
["Head12","Forecast 2010/11",null,"Year4"]
["Head13","Forecast 2011/12",null,"Year5"]
["Head14","Forecast 2012/13",null,"Year6"]
["Head15","Forecast 2013/14",null,"Year7"]
["Head16","Forecast 2014/15",null,"Year8"]
["Head17","Forecast 2015/16",null,"Year9"]
["Head18","Forecast 2016/17",null,"Year10"]
["Head19","Forecast 2017/18",null,"Year11"]
["Head20","Forecast 2018/19",null,"Year12"]
["Head21","Forecast 2019/20",null,"Year13"]
["Head22","Forecast 2020/21",null,"Year14"]
["Head23","Forecast 2021/22",null,"Year15"]
["Head24","Description",null,"Desc"]
["Head25","Schedule of funding diligence",null,"fdil"]
["Head26","Vote Description",null,"VDesc"]
["Head27","Ref"]
["Head27a","References"]
["Head28","Surplus/ (Deficit) for the year",null,"Result"]
["Head29","Annual target 2007/08"]
["Head30","Revised target 2007/08"]
["Head31","Quarter ended 30 September"]
["Head32","Quarter ended 31 December"]
["Head33","Quarter ended 31 March"]
["Head34","Quarter ended 30 June"]
["Head35","Variance explanation"]
["Head36","YTD  Actual 31 Dec"]
["Head37","YTD  Budget 31 Dec"]
["Head38","Monthly actual"]
["Head39","YearTD actual"]
["Head40","YearTD budget"]
["Head41","YTD variance"]
["Head42","Surplus/ (Deficit) for the yr/period"]
["Head43",{"$f":"Head3&\" Summary\"","v":"2019/20 Medium Term Revenue & Expenditure Framework Summary"}]
["Head44","1996 Census"]
["Head45","2001 Census"]
["Head46"," - Adjustments Budget - Month YYYY"]
["Head47","Previous target year to complete"]
["Head48","Present value"]
["Head49","Virement"]
["Head50","Other Adjusts."]
["Head51","Accum. Funds"]
["Head52","Multi-year capital"]
["Head53","Unfore. Unavoid."]
["Head54","Prior Adjusted"]
["Head55","Nat. or Prov. Govt"]
["Head56","Total Adjusts."]
["Head57",{"$f":"date","v":"M01 July"}]
["Head58","Parent muni."]
["Head59","Downward adjusts"]
["Head60","Month","Report header part name",{"$f":"MONTH(date)","v":{"$error":"#VALUE!"}}]
["SFPerf1","Budgeted Financial Performance"]
["SFPerf2","Forecast Financial Performance"]
["SFPos1","Budgeted Financial Position"]
["SFPos2","Forecast Financial Position"]
["Cash1","Budget Cash Flow"]
["Cash2","Forecast Cash Flow"]
["RandM","Expenditure includes repairs & maintenance of R'000"]
["Standard nomenclature"]
["Muni",{"$f":"'Lookup and lists'!B27","v":"LIM331 Greater Giyani"}]
["Municipal Entities",2,"Type of report:",3]
[{"$f":"IF((MuniEntities=1)*(MuniType=2),\"YES\",\"NO\")","v":"NO"},"Does this municipality have entities (consolidated budget and entity budgets required)? YES/NO"]
["s71 (Monthly Mayor report) schedules and charts"]
["S71sum",{"$f":"IF(Consolques=\"YES\",E77,F77)","v":"Table C1 Monthly Budget Statement Summary"},null,"Table C1 ",{"$f":"D77&\"Consolidated Monthly Budget Statement Summary\"","v":"Table C1 Consolidated Monthly Budget Statement Summary"},{"$f":"D77&\"Monthly Budget Statement Summary\"","v":"Table C1 Monthly Budget Statement Summary"}]
["S71C","Table C3 Monthly Budget Statement - Financial Performance (revenue and expenditure by municipal vote)",null,"Table C3 ",{"$f":"D78&\"Consolidated Monthly Budget Statement - Financial Performance (revenue and expenditure by municipal vote) \"","v":"Table C3 Consolidated Monthly Budget Statement - Financial Performance (revenue and expenditure by municipal vote) "},{"$f":"D78&\"Monthly Budget Statement - Financial Performance (revenue and expenditure by municipal vote)\"","v":"Table C3 Monthly Budget Statement - Financial Performance (revenue and expenditure by municipal vote)"}]
["S71A",{"$f":"IF(Consolques=\"YES\",E79,F79)","v":"Table C2 Monthly Budget Statement - Financial Performance (functional classification)"},null,"Table C2 ",{"$f":"D79&\"Consolidated Monthly Budget Statement - Financial Performance (functional classification) \"","v":"Table C2 Consolidated Monthly Budget Statement - Financial Performance (functional classification) "},{"$f":"D79&\"Monthly Budget Statement - Financial Performance (functional classification)\"","v":"Table C2 Monthly Budget Statement - Financial Performance (functional classification)"}]
["S71B",{"$f":"IF(Consolques=\"YES\",E80,F80)","v":"Table C4 Monthly Budget Statement - Financial Performance (revenue and expenditure)"},null,"Table C4 ",{"$f":"D80&\"Consolidated Monthly Budget Statement - Financial Performance (revenue and expenditure) \"","v":"Table C4 Consolidated Monthly Budget Statement - Financial Performance (revenue and expenditure) "},{"$f":"D80&\"Monthly Budget Statement - Financial Performance (revenue and expenditure)\"","v":"Table C4 Monthly Budget Statement - Financial Performance (revenue and expenditure)"}]
["S71D",{"$f":"IF(Consolques=\"YES\",E81,F81)","v":"Table C5 Monthly Budget Statement - Capital Expenditure (municipal vote, functional classification and funding)"},null,"Table C5 ",{"$f":"D81&\"Consolidated Monthly Budget Statement - Capital Expenditure (municipal vote, functional classification and funding \"","v":"Table C5 Consolidated Monthly Budget Statement - Capital Expenditure (municipal vote, functional classification and funding "},{"$f":"D81&\"Monthly Budget Statement - Capital Expenditure (municipal vote, functional classification and funding)\"","v":"Table C5 Monthly Budget Statement - Capital Expenditure (municipal vote, functional classification and funding)"}]
["S71E","Table C6 Monthly Budget Statement - Financial Position",null,"Table C6 ",{"$f":"D82&\"Consolidated Monthly Budget Statement - Financial Position \"","v":"Table C6 Consolidated Monthly Budget Statement - Financial Position "},{"$f":"D82&\"Monthly Budget Statement - Financial Position\"","v":"Table C6 Monthly Budget Statement - Financial Position"}]
["S71F","Table C7 Monthly Budget Statement - Cash Flow ",null,"Table C7 ",{"$f":"D83&\"Consolidated Monthly Budget Statement - Cash Flow \"","v":"Table C7 Consolidated Monthly Budget Statement - Cash Flow "},{"$f":"D83&\"Monthly Budget Statement - Cash Flow \"","v":"Table C7 Monthly Budget Statement - Cash Flow "}]
["S71G",{"$f":"D84&\"Material variance explanations \"","v":"Supporting Table SC1 Material variance explanations "},null,"Supporting Table SC1 "]
["S71H",{"$f":"D85&\"Monthly Budget Statement - performance indicators  \"","v":"Supporting Table SC2 Monthly Budget Statement - performance indicators  "},null,"Supporting Table SC2 "]
["S71I",{"$f":"D86&\"Monthly Budget Statement - aged debtors\"","v":"Supporting Table SC3 Monthly Budget Statement - aged debtors"},null,"Supporting Table SC3 "]
["S71J",{"$f":"D87&\"Monthly Budget Statement - aged creditors \"","v":"Supporting Table SC4 Monthly Budget Statement - aged creditors "},null,"Supporting Table SC4 "]
["S71K",{"$f":"D88&\"Monthly Budget Statement - investment portfolio \"","v":"Supporting Table SC5 Monthly Budget Statement - investment portfolio "},null,"Supporting Table SC5 "]
["S71L",{"$f":"D89&\"Monthly Budget Statement - transfers and grant receipts \"","v":"Supporting Table SC6 Monthly Budget Statement - transfers and grant receipts "},null,"Supporting Table SC6 "]
["S71M",{"$f":"D90&\" Monthly Budget Statement - transfers and grant expenditure \"","v":"Supporting Table SC7(1) Monthly Budget Statement - transfers and grant expenditure "},null,"Supporting Table SC7(1)"]
["S71N",{"$f":"D91&\"Monthly Budget Statement - councillor and staff benefits \"","v":"Supporting Table SC8 Monthly Budget Statement - councillor and staff benefits "},null,"Supporting Table SC8 "]
["S71O",{"$f":"D92&\"Monthly Budget Statement - actuals and revised targets for cash receipts\"","v":"Supporting Table SC9 Monthly Budget Statement - actuals and revised targets for cash receipts"},null,"Supporting Table SC9 "]
["S71P",{"$f":"IF(Consolques=\"YES\",E93,F93)","v":"NOT REQUIRED - municipality does not have entities or this is the parent municipality's budget"},null,"Supporting Table SC10 ",{"$f":"D93&\"Monthly Budget Statement  - Parent Municipality Financial Performance (revenue and expenditure) \"","v":"Supporting Table SC10 Monthly Budget Statement  - Parent Municipality Financial Performance (revenue and expenditure) "},"NOT REQUIRED - municipality does not have entities or this is the parent municipality's budget"]
["S71Q","NOT REQUIRED - municipality does not have entities or this is the parent municipality's budget",null,"Supporting Table SC11 ",{"$f":"D94&\"Monthly Budget Statement - summary of municipal entities\"","v":"Supporting Table SC11 Monthly Budget Statement - summary of municipal entities"},"NOT REQUIRED - municipality does not have entities or this is the parent municipality's budget"]
["S71R","Supporting Table SC12 Monthly Budget Statement - capital expenditure trend",null,"Supporting Table SC12 ",{"$f":"D95&\"Consolidated Monthly Budget Statement - capital expenditure trend \"","v":"Supporting Table SC12 Consolidated Monthly Budget Statement - capital expenditure trend "},{"$f":"D95&\"Monthly Budget Statement - capital expenditure trend\"","v":"Supporting Table SC12 Monthly Budget Statement - capital expenditure trend"}]
["S71Sa","Supporting Table SC13a Monthly Budget Statement - capital expenditure on new assets by asset class",null,"Supporting Table SC13a ",{"$f":"D96&\"Consolidated Monthly Budget Statement - capital expenditure on new assets by asset class\"","v":"Supporting Table SC13a Consolidated Monthly Budget Statement - capital expenditure on new assets by asset class"},{"$f":"D96&\"Monthly Budget Statement - capital expenditure on new assets by asset class\"","v":"Supporting Table SC13a Monthly Budget Statement - capital expenditure on new assets by asset class"}]
["S71Sb","Supporting Table SC13b Monthly Budget Statement - capital expenditure on renewal of existing assets by asset class",null,"Supporting Table SC13b ",{"$f":"D97&\"Consolidated Monthly Budget Statement - capital expenditure on renewal of existing assets by asset class\"","v":"Supporting Table SC13b Consolidated Monthly Budget Statement - capital expenditure on renewal of existing assets by asset class"},{"$f":"D97&\"Monthly Budget Statement - capital expenditure on renewal of existing assets by asset class\"","v":"Supporting Table SC13b Monthly Budget Statement - capital expenditure on renewal of existing assets by asset class"}]
["S71Sc","Supporting Table SC13c Monthly Budget Statement - expenditure on repairs and maintenance by asset class",null,"Supporting Table SC13c ",{"$f":"D98&\"Consolidated Monthly Budget Statement - expenditure on repairs and maintenance by asset class\"","v":"Supporting Table SC13c Consolidated Monthly Budget Statement - expenditure on repairs and maintenance by asset class"},{"$f":"D98&\"Monthly Budget Statement - expenditure on repairs and maintenance by asset class\"","v":"Supporting Table SC13c Monthly Budget Statement - expenditure on repairs and maintenance by asset class"}]
["S71Sd","Supporting Table SC13d Monthly Budget Statement - depreciation by asset class",null,"Supporting Table SC13d ",{"$f":"D99&\"Consolidated Monthly Budget Statement - depreciation by asset class\"","v":"Supporting Table SC13d Consolidated Monthly Budget Statement - depreciation by asset class"},{"$f":"D99&\"Monthly Budget Statement - depreciation by asset class\"","v":"Supporting Table SC13d Monthly Budget Statement - depreciation by asset class"}]
["S71Se",{"$f":"IF(Consolques=\"YES\",E100,F100)","v":"Supporting Table SC13e Monthly Budget Statement - capital expenditure on upgrading of existing assets by asset class"},null,"Supporting Table SC13e ",{"$f":"D100&\"Consolidated Monthly Budget Statement - capital expenditure on upgrading of existing assets by asset class\"","v":"Supporting Table SC13e Consolidated Monthly Budget Statement - capital expenditure on upgrading of existing assets by asset class"},{"$f":"D100&\"Monthly Budget Statement - capital expenditure on upgrading of existing assets by asset class\"","v":"Supporting Table SC13e Monthly Budget Statement - capital expenditure on upgrading of existing assets by asset class"}]
[null,"s71 charts listing"]
[null,{"$f":"D102&Head2A&\" Capital Expenditure Monthly Trend: actual v target\"","v":"Chart C1 2019/20 Capital Expenditure Monthly Trend: actual v target"},null,"Chart C1 "]
[null,{"$f":"D103&Head2A&\" Capital Expenditure: YTD actual v YTD target\"","v":"Chart C2 2019/20 Capital Expenditure: YTD actual v YTD target"},null,"Chart C2 "]
[null,{"$f":"D104&\"Aged Consumer Debtors Analysis\"","v":"Chart C3 Aged Consumer Debtors Analysis"},null,"Chart C3 "]
[null,{"$f":"D105&\"Consumer Debtors (total by Debtor Customer Category)\"","v":"Chart C4 Consumer Debtors (total by Debtor Customer Category)"},null,"Chart C4 "]
[null,{"$f":"D106&\"Aged Creditors Analysis\"","v":"Chart C5 Aged Creditors Analysis"},null,"Chart C5 "]
["S71T",{"$f":"D107&\" Monthly Budget Statement - Expenditure against approved rollovers\"","v":"Supporting Table SC7(2) Monthly Budget Statement - Expenditure against approved rollovers"},null,"Supporting Table SC7(2)"]

{"sheet":"Lookup and lists","index":3,"n_rows":307,"n_cols":22,"rows_kept":307,"cut":false,"hidden":true,"merged":[]}
["Description",2007,2008,2009,2010,2011,2012,2013,2014,2015,2016,2017,2018,2019,2020,null,"Grants:","National - opex","Provincial - opex","National - capex","Provincial - capex","YESNO"]
[{"$f":"'Template names'!C2","v":"Prior year -1"},"2006/07","2007/08","2008/09",{"$f":"E1-1&\"/\"&RIGHT(E1,2)-0","v":"2009/10"},{"$f":"F1-1&\"/\"&RIGHT(F1,2)-0","v":"2010/11"},"2011/12","2012/13","2013/14","2014/15","2015/16","2016/17","2017/18","2018/19","2019/20",null,null,"Local Government Equitable Share","Health subsidy","Municipal Infrastructure Grant (MIG)","Agriculture","Yes"]
[{"$f":"'Template names'!C5","v":"MTREF header name"},"2007/08 Medium Term Revenue & Expenditure Framework","2008/09 Medium Term Revenue & Expenditure Framework","2009/10 Medium Term Revenue & Expenditure Framework",{"$f":"E1&\"/\"&RIGHT(E1,2)+1&\" Medium Term Revenue & Expenditure Framework\"","v":"2010/11 Medium Term Revenue & Expenditure Framework"},{"$f":"F1&\"/\"&RIGHT(F1,2)+1&\" Medium Term Revenue & Expenditure Framework\"","v":"2011/12 Medium Term Revenue & Expenditure Framework"},"2012/13 Medium Term Revenue & Expenditure Framework","2013/14 Medium Term Revenue & Expenditure Framework","2014/15 Medium Term Revenue & Expenditure Framework","2015/16 Medium Term Revenue & Expenditure Framework","2016/17 Medium Term Revenue & Expenditure Framework","2017/18 Medium Term Revenue & Expenditure Framework","2018/19 Medium Term Revenue & Expenditure Framework","2019/20 Medium Term Revenue & Expenditure Framework","2020/21 Medium Term Revenue & Expenditure Framework",null,null,"RSC Levy Replacement ","Ambulance subsidy","Public Transport and Systems","Education","No"]
[{"$f":"'Template names'!C4","v":"Approved budget year"},"2007/08","2008/09","2009/10",{"$f":"E1&\"/\"&RIGHT(E1,2)+1","v":"2010/11"},{"$f":"F1&\"/\"&RIGHT(F1,2)+1","v":"2011/12"},"2012/13","2013/14","2014/15","2015/16","2016/17","2017/18","2018/19","2019/20","2020/21",null,null,"Finance Management ","Housing","Rural Transport Services and Infrastructure","Health"]
[{"$f":"'Template names'!C12","v":"1st year of MTREF"},"Budget Year 2007/08","Budget Year 2008/09","Budget Year 2009/10",{"$f":"\"Budget Year \"&E1&\"/\"&RIGHT(E1,2)+1","v":"Budget Year 2010/11"},{"$f":"\"Budget Year \"&F1&\"/\"&RIGHT(F1,2)+1","v":"Budget Year 2011/12"},"Budget Year 2012/13","Budget Year 2013/14","Budget Year 2014/15","Budget Year 2015/16","Budget Year 2016/17","Budget Year 2017/18","Budget Year 2018/19","Budget Year 2019/20","Budget Year 2020/21",null,null,"Municipal Systems Improvement","Sport and Recreation","Regional Bulk Infrastructure","Housing and Local Government "]
[{"$f":"'Template names'!C13","v":"2nd year of MTREF"},"Budget Year +1 2008/09","Budget Year +1 2009/10","Budget Year +1 2010/11",{"$f":"\"Budget Year +1 \"&E1+1&\"/\"&RIGHT(E1,2)+2","v":"Budget Year +1 2011/12"},{"$f":"\"Budget Year +1 \"&F1+1&\"/\"&RIGHT(F1,2)+2","v":"Budget Year +1 2012/13"},"Budget Year +1 2013/14","Budget Year +1 2014/15","Budget Year +1 2015/16","Budget Year +1 2016/17","Budget Year +1 2017/18","Budget Year +1 2018/19","Budget Year +1 2019/20","Budget Year +1 2020/21","Budget Year +1 2021/22",null,null,"Water Services Operating Subsidy ",null,"Rural Households Infrastructure ","Other Departments"]
[{"$f":"'Template names'!C14","v":"3rd year of MTREF"},"Budget Year +2 2009/10","Budget Year +2 2010/11","Budget Year +2 2011/12",{"$f":"\"Budget Year +2 \"&E1+2&\"/\"&RIGHT(E1,2)+3","v":"Budget Year +2 2012/13"},{"$f":"\"Budget Year +2 \"&F1+2&\"/\"&RIGHT(F1,2)+3","v":"Budget Year +2 2013/14"},"Budget Year +2 2014/15","Budget Year +2 2015/16","Budget Year +2 2016/17","Budget Year +2 2017/18","Budget Year +2 2018/19","Budget Year +2 2019/20","Budget Year +2 2020/21","Budget Year +2 2021/22","Budget Year +2 2022/23",null,null,"Energy Efficiency  and Demand Management",null,"Neighbourhood Development Partnership","Public Works, Roads, Transport "]
["NOTE: This sheet should not be directly amended - select headings from sheet 'S'",null,null,null,null,null,null,null,null,null,null,null,null,null,null,null,null,"Integrated National Electrification Programme",null,"2010 FIFA World Cup Stadiums Development","Sport and Recreation"]
[null,null,null,null,null,null,null,null,null,null,null,null,null,null,null,null,null,"Municipal Drought Relief "]
[null,null,null,null,null,null,null,null,null,null,null,null,null,null,null,null,null,"2010 FIFA World Cup Operating"]
[null,null,null,null,null,null,null,null,null,null,null,null,null,null,null,null,null,"Electricity Demand Side Management"]
[null,null,null,null,null,null,null,null,null,null,null,null,null,null,null,null,null,"EPWP Incentive"]
[]
[]
[]
[]
[]
[]
[]
[]
[]
[]
[]
[]
[]
["Name link",129]
["Name of Muni",{"$f":"INDEX(B28:B311,B26,1)","v":"LIM331 Greater Giyani"}]
[null,"Choose name from list","Set name on 'Instructions' sheet"]
[null,"BUF Buffalo City","EC EASTERN CAPE"]
[null,"NMA Nelson Mandela Bay","EC EASTERN CAPE"]
[null,"EC101 Dr Beyers Naude","EC EASTERN CAPE"]
[null,"EC102 Blue Crane Route","EC EASTERN CAPE"]
[null,"EC104 Makana","EC EASTERN CAPE"]
[null,"EC105 Ndlambe","EC EASTERN CAPE"]
[null,"EC106 Sundays River Valley","EC EASTERN CAPE"]
[null,"EC108 Kouga","EC EASTERN CAPE"]
[null,"EC109 Kou-Kamma","EC EASTERN CAPE"]
[null,"DC10 Sarah Baartman","EC EASTERN CAPE"]
[null,"EC121 Mbhashe","EC EASTERN CAPE"]
[null,"EC122 Mnquma","EC EASTERN CAPE"]
[null,"EC123 Great Kei","EC EASTERN CAPE"]
[null,"EC124 Amahlathi","EC EASTERN CAPE"]
[null,"EC126 Ngqushwa","EC EASTERN CAPE"]
[null,"EC129 Raymond Mhlaba","EC EASTERN CAPE"]
[null,"DC12 Amathole","EC EASTERN CAPE"]
[null,"EC131 Inxuba Yethemba","EC EASTERN CAPE"]
[null,"EC135 Intsika Yethu","EC EASTERN CAPE"]
[null,"EC136 Emalahleni (Ec)","EC EASTERN CAPE"]
[null,"EC137 Engcobo","EC EASTERN CAPE"]
[null,"EC138 Sakhisizwe","EC EASTERN CAPE"]
[null,"EC139 Enoch Mgijima","EC EASTERN CAPE"]
[null,"DC13 Chris Hani","EC EASTERN CAPE"]
[null,"EC141 Elundini","EC EASTERN CAPE"]
[null,"EC142 Senqu","EC EASTERN CAPE"]
[null,"EC145 Walter Sisulu","EC EASTERN CAPE"]
[null,"DC14 Joe Gqabi","EC EASTERN CAPE"]
[null,"EC153 Ngquza Hills","EC EASTERN CAPE"]
[null,"EC154 Port St Johns","EC EASTERN CAPE"]
[null,"EC155 Nyandeni","EC EASTERN CAPE"]
[null,"EC156 Mhlontlo","EC EASTERN CAPE"]
[null,"EC157 King Sabata Dalindyebo","EC EASTERN CAPE"]
[null,"DC15 O .R. Tambo","EC EASTERN CAPE"]
[null,"EC441 Matatiele","EC EASTERN CAPE"]
[null,"EC442 Umzimvubu","EC EASTERN CAPE"]
[null,"EC443 Mbizana","EC EASTERN CAPE"]
[null,"EC444 Ntabankulu","EC EASTERN CAPE"]
[null,"DC44 Alfred Nzo","EC EASTERN CAPE"]
[null,"MAN Mangaung","FS FREE STATE"]
[null,"FS161 Letsemeng","FS FREE STATE"]
[null,"FS162 Kopanong","FS FREE STATE"]
[null,"FS163 Mohokare","FS FREE STATE"]
[null,"DC16 Xhariep","FS FREE STATE"]
[null,"FS181 Masilonyana","FS FREE STATE"]
[null,"FS182 Tokologo","FS FREE STATE"]
[null,"FS183 Tswelopele","FS FREE STATE"]
[null,"FS184 Matjhabeng","FS FREE STATE"]
[null,"FS185 Nala","FS FREE STATE"]
[null,"DC18 Lejweleputswa","FS FREE STATE"]
[null,"FS191 Setsoto","FS FREE STATE"]
[null,"FS192 Dihlabeng","FS FREE STATE"]
[null,"FS193 Nketoana","FS FREE STATE"]
[null,"FS194 Maluti-a-Phofung","FS FREE STATE"]
[null,"FS195 Phumelela","FS FREE STATE"]
[null,"FS196 Mantsopa","FS FREE STATE"]
[null,"DC19 Thabo Mofutsanyana","FS FREE STATE"]
[null,"FS201 Moqhaka","FS FREE STATE"]
[null,"FS203 Ngwathe","FS FREE STATE"]
[null,"FS204 Metsimaholo","FS FREE STATE"]
[null,"FS205 Mafube","FS FREE STATE"]
[null,"DC20 Fezile Dabi","FS FREE STATE"]
[null,"EKU City of Ekurhuleni","GT GAUTENG"]
[null,"JHB City Of Johannesburg","GT GAUTENG"]
[null,"TSH City Of Tshwane","GT GAUTENG"]
[null,"GT421 Emfuleni","GT GAUTENG"]
[null,"GT422 Midvaal","GT GAUTENG"]
[null,"GT423 Lesedi","GT GAUTENG"]
[null,"DC42 Sedibeng","GT GAUTENG"]
[null,"GT481 Mogale City","GT GAUTENG"]
[null,"GT484 Merafong City","GT GAUTENG"]
[null,"GT485 Rand West City","GT GAUTENG"]
[null,"DC48 West Rand","GT GAUTENG"]
[null,"ETH eThekwini","KZN KWAZULU-NATAL"]
[null,"KZN212 Umdoni","KZN KWAZULU-NATAL"]
[null,"KZN213 Umzumbe","KZN KWAZULU-NATAL"]
[null,"KZN214 uMuziwabantu","KZN KWAZULU-NATAL"]
[null,"KZN216 Ray Nkonyeni","KZN KWAZULU-NATAL"]
[null,"DC21 Ugu","KZN KWAZULU-NATAL"]
[null,"KZN221 uMshwathi","KZN KWAZULU-NATAL"]
[null,"KZN222 uMngeni","KZN KWAZULU-NATAL"]
[null,"KZN223 Mpofana","KZN KWAZULU-NATAL"]
[null,"KZN224 Impendle","KZN KWAZULU-NATAL"]
[null,"KZN225 Msunduzi","KZN KWAZULU-NATAL"]
[null,"KZN226 Mkhambathini","KZN KWAZULU-NATAL"]
[null,"KZN227 Richmond","KZN KWAZULU-NATAL"]
[null,"DC22 uMgungundlovu","KZN KWAZULU-NATAL"]
[null,"KZN235 Okhahlamba","KZN KWAZULU-NATAL"]
[null,"KZN237 Inkosi Langalibalele","KZN KWAZULU-NATAL"]
[null,"KZN238 Alfred Duma","KZN KWAZULU-NATAL"]
[null,"DC23 Uthukela","KZN KWAZULU-NATAL"]
[null,"KZN241 Endumeni","KZN KWAZULU-NATAL"]
[null,"KZN242 Nquthu","KZN KWAZULU-NATAL"]
[null,"KZN244 Msinga","KZN KWAZULU-NATAL"]
[null,"KZN245 Umvoti","KZN KWAZULU-NATAL"]
[null,"DC24 Umzinyathi","KZN KWAZULU-NATAL"]
[null,"KZN252 Newcastle","KZN KWAZULU-NATAL"]
[null,"KZN253 Emadlangeni","KZN KWAZULU-NATAL"]
[null,"KZN254 Dannhauser","KZN KWAZULU-NATAL"]
[null,"DC25 Amajuba","KZN KWAZULU-NATAL"]
[null,"KZN261 eDumbe","KZN KWAZULU-NATAL"]
[null,"KZN262 uPhongolo","KZN KWAZULU-NATAL"]
[null,"KZN263 Abaqulusi","KZN KWAZULU-NATAL"]
[null,"KZN265 Nongoma","KZN KWAZULU-NATAL"]
[null,"KZN266 Ulundi","KZN KWAZULU-NATAL"]
[null,"DC26 Zululand","KZN KWAZULU-NATAL"]
[null,"KZN271 Umhlabuyalingana","KZN KWAZULU-NATAL"]
[null,"KZN272 Jozini","KZN KWAZULU-NATAL"]
[null,"KZN275 Mtubatuba","KZN KWAZULU-NATAL"]
[null,"KZN276 Hlabisa Big Five","KZN KWAZULU-NATAL"]
[null,"DC27 Umkhanyakude","KZN KWAZULU-NATAL"]
[null,"KZN281 Mfolozi","KZN KWAZULU-NATAL"]
[null,"KZN282 uMhlathuze","KZN KWAZULU-NATAL"]
[null,"KZN284 uMlalazi","KZN KWAZULU-NATAL"]
[null,"KZN285 Mthonjaneni","KZN KWAZULU-NATAL"]
[null,"KZN286 Nkandla","KZN KWAZULU-NATAL"]
[null,"DC28 King Cetshwayo","KZN KWAZULU-NATAL"]
[null,"KZN291 Mandeni","KZN KWAZULU-NATAL"]
[null,"KZN292 KwaDukuza","KZN KWAZULU-NATAL"]
[null,"KZN293 Ndwedwe","KZN KWAZULU-NATAL"]
[null,"KZN294 Maphumulo","KZN KWAZULU-NATAL"]
[null,"DC29 iLembe","KZN KWAZULU-NATAL"]
[null,"KZN433 Greater Kokstad","KZN KWAZULU-NATAL"]
[null,"KZN434 Ubuhlebezwe","KZN KWAZULU-NATAL"]
[null,"KZN435 Umzimkhulu","KZN KWAZULU-NATAL"]
[null,"KZN436 Dr Nkosazana Dlamini Zuma","KZN KWAZULU-NATAL"]
[null,"DC43 Harry Gwala","KZN KWAZULU-NATAL"]
[null,"LIM331 Greater Giyani","LIM LIMPOPO"]
[null,"LIM332 Greater Letaba","LIM LIMPOPO"]
[null,"LIM333 Greater Tzaneen","LIM LIMPOPO"]
[null,"LIM334 Ba-Phalaborwa","LIM LIMPOPO"]
[null,"LIM335 Maruleng","LIM LIMPOPO"]
[null,"DC33 Mopani","LIM LIMPOPO"]
[null,"LIM341 Musina","LIM LIMPOPO"]
[null,"LIM343 Thulamela","LIM LIMPOPO"]
[null,"LIM344 Makhado","LIM LIMPOPO"]
[null,"LIM345 Collins Chabane","LIM LIMPOPO"]
[null,"DC34 Vhembe","LIM LIMPOPO"]
[null,"LIM351 Blouberg","LIM LIMPOPO"]
[null,"LIM353 Molemole","LIM LIMPOPO"]
[null,"LIM354 Polokwane","LIM LIMPOPO"]
[null,"LIM355 Lepelle-Nkumpi","LIM LIMPOPO"]
[null,"DC35 Capricorn","LIM LIMPOPO"]
[null,"LIM361 Thabazimbi","LIM LIMPOPO"]
[null,"LIM362 Lephalale","LIM LIMPOPO"]
[null,"LIM366 Bela Bela","LIM LIMPOPO"]
[null,"LIM367 Mogalakwena","LIM LIMPOPO"]
[null,"LIM368 Modimolle-Mookgopong","LIM LIMPOPO"]
[null,"DC36 Waterberg","LIM LIMPOPO"]
[null,"LIM471 Ephraim Mogale","LIM LIMPOPO"]
[null,"LIM472 Elias Motsoaledi","LIM LIMPOPO"]
[null,"LIM473 Makhuduthamaga","LIM LIMPOPO"]
[null,"LIM476 Tubatse Fetakgomo","LIM LIMPOPO"]
[null,"DC47 Sekhukhune","LIM LIMPOPO"]
[null,"MP301 Albert Luthuli","MP MPUMALANGA"]
[null,"MP302 Msukaligwa","MP MPUMALANGA"]
[null,"MP303 Mkhondo","MP MPUMALANGA"]
[null,"MP304 Pixley Ka Seme (MP)","MP MPUMALANGA"]
[null,"MP305 Lekwa","MP MPUMALANGA"]
[null,"MP306 Dipaleseng","MP MPUMALANGA"]
[null,"MP307 Govan Mbeki","MP MPUMALANGA"]
[null,"DC30 Gert Sibande","MP MPUMALANGA"]
[null,"MP311 Victor Khanye","MP MPUMALANGA"]
[null,"MP312 Emalahleni (Mp)","MP MPUMALANGA"]
[null,"MP313 Steve Tshwete","MP MPUMALANGA"]
[null,"MP314 Emakhazeni","MP MPUMALANGA"]
[null,"MP315 Thembisile Hani","MP MPUMALANGA"]
[null,"MP316 Dr J.S. Moroka","MP MPUMALANGA"]
[null,"DC31 Nkangala","MP MPUMALANGA"]
[null,"MP321 Thaba Chweu","MP MPUMALANGA"]
[null,"MP324 Nkomazi","MP MPUMALANGA"]
[null,"MP325 Bushbuckridge","MP MPUMALANGA"]
[null,"MP326 City of Mbombela","MP MPUMALANGA"]
[null,"DC32 Ehlanzeni","MP MPUMALANGA"]
[null,"NC451 Joe Morolong","NC NORTHERN CAPE"]
[null,"NC452 Ga-Segonyana","NC NORTHERN CAPE"]
[null,"NC453 Gamagara","NC NORTHERN CAPE"]
[null,"DC45 John Taolo Gaetsewe","NC NORTHERN CAPE"]
[null,"NC061 Richtersveld","NC NORTHERN CAPE"]
[null,"NC062 Nama Khoi","NC NORTHERN CAPE"]
[null,"NC064 Kamiesberg","NC NORTHERN CAPE"]
[null,"NC065 Hantam","NC NORTHERN CAPE"]
[null,"NC066 Karoo Hoogland","NC NORTHERN CAPE"]
[null,"NC067 Khai-Ma","NC NORTHERN CAPE"]
[null,"DC6 Namakwa","NC NORTHERN CAPE"]
[null,"NC071 Ubuntu","NC NORTHERN CAPE"]
[null,"NC072 Umsobomvu","NC NORTHERN CAPE"]
[null,"NC073 Emthanjeni","NC NORTHERN CAPE"]
[null,"NC074 Kareeberg","NC NORTHERN CAPE"]
[null,"NC075 Renosterberg","NC NORTHERN CAPE"]
[null,"NC076 Thembelihle","NC NORTHERN CAPE"]
[null,"NC077 Siyathemba","NC NORTHERN CAPE"]
[null,"NC078 Siyancuma","NC NORTHERN CAPE"]
[null,"DC7 Pixley Ka Seme (Nc)","NC NORTHERN CAPE"]
[null,"NC082 !Kai! Garib","NC NORTHERN CAPE"]
[null,"NC084 !Kheis","NC NORTHERN CAPE"]
[null,"NC085 Tsantsabane","NC NORTHERN CAPE"]
[null,"NC086 Kgatelopele","NC NORTHERN CAPE"]
[null,"NC087 Dawid Kruiper","NC NORTHERN CAPE"]
[null,"DC8 Z F Mgcawu","NC NORTHERN CAPE"]
[null,"NC091 Sol Plaatje","NC NORTHERN CAPE"]
[null,"NC092 Dikgatlong","NC NORTHERN CAPE"]
[null,"NC093 Magareng","NC NORTHERN CAPE"]
[null,"NC094 Phokwane","NC NORTHERN CAPE"]
[null,"DC9 Frances Baard","NC NORTHERN CAPE"]
[null,"NW371 Moretele","NW NORTH WEST"]
[null,"NW372 Madibeng","NW NORTH WEST"]
[null,"NW373 Rustenburg","NW NORTH WEST"]
[null,"NW374 Kgetlengrivier","NW NORTH WEST"]
[null,"NW375 Moses Kotane","NW NORTH WEST"]
[null,"DC37 Bojanala Platinum","NW NORTH WEST"]
[null,"NW381 Ratlou","NW NORTH WEST"]
[null,"NW382 Tswaing","NW NORTH WEST"]
[null,"NW383 Mafikeng","NW NORTH WEST"]
[null,"NW384 Ditsobotla","NW NORTH WEST"]
[null,"NW385 Ramotshere Moiloa","NW NORTH WEST"]
[null,"DC38 Ngaka Modiri Molema","NW NORTH WEST"]
[null,"NW392 Naledi (Nw)","NW NORTH WEST"]
[null,"NW393 Mamusa","NW NORTH WEST"]
[null,"NW394 Greater Taung","NW NORTH WEST"]
[null,"NW396 Lekwa-Teemane","NW NORTH WEST"]
[null,"NW397 Kagisano-Molopo","NW NORTH WEST"]
[null,"DC39 Dr Ruth Segomotsi Mompati","NW NORTH WEST"]
[null,"NW403 City Of Matlosana","NW NORTH WEST"]
[null,"NW404 Maquassi Hills","NW NORTH WEST"]
[null,"NW405 J B Marks","NW NORTH WEST"]
[null,"DC40 Dr Kenneth Kaunda","NW NORTH WEST"]
[null,"CPT Cape Town","WC WESTERN CAPE"]
[null,"WC011 Matzikama","WC WESTERN CAPE"]
[null,"WC012 Cederberg","WC WESTERN CAPE"]
[null,"WC013 Bergrivier","WC WESTERN CAPE"]
[null,"WC014 Saldanha Bay","WC WESTERN CAPE"]
[null,"WC015 Swartland","WC WESTERN CAPE"]
[null,"DC1 West Coast","WC WESTERN CAPE"]
[null,"WC022 Witzenberg","WC WESTERN CAPE"]
[null,"WC023 Drakenstein","WC WESTERN CAPE"]
[null,"WC024 Stellenbosch","WC WESTERN CAPE"]
[null,"WC025 Breede Valley","WC WESTERN CAPE"]
[null,"WC026 Langeberg","WC WESTERN CAPE"]
[null,"DC2 Cape Winelands DM","WC WESTERN CAPE"]
[null,"WC031 Theewaterskloof","WC WESTERN CAPE"]
[null,"WC032 Overstrand","WC WESTERN CAPE"]
[null,"WC033 Cape Agulhas","WC WESTERN CAPE"]
[null,"WC034 Swellendam","WC WESTERN CAPE"]
[null,"DC3 Overberg","WC WESTERN CAPE"]
[null,"WC041 Kannaland","WC WESTERN CAPE"]
[null,"WC042 Hessequa","WC WESTERN CAPE"]
[null,"WC043 Mossel Bay","WC WESTERN CAPE"]
[null,"WC044 George","WC WESTERN CAPE"]
[null,"WC045 Oudtshoorn","WC WESTERN CAPE"]
[null,"WC047 Bitou","WC WESTERN CAPE"]
[null,"WC048 Knysna","WC WESTERN CAPE"]
[null,"DC4 Garden Route","WC WESTERN CAPE"]
[null,"WC051 Laingsburg","WC WESTERN CAPE"]
[null,"WC052 Prince Albert","WC WESTERN CAPE"]
[null,"WC053 Beaufort West","WC WESTERN CAPE"]
[null,"DC5 Central Karoo","WC WESTERN CAPE"]
[]
[]
[]
[]
[]
[]
[]
[]
[]
[]
[]
[]
[]
[]
[]
[]
[]
[]
[]
[]
[]
[null,null,{"$f":"COUNTA(C29:C306)","v":257}]

{"sheet":"Org structure","index":4,"n_rows":166,"n_cols":4,"rows_kept":166,"cut":false,"hidden":false,"merged":[]}
["Organisational Structure Votes",null,"Organisational Structure Sub-Votes"]
[{"$f":"B2&\" - \"&C2","v":"Vote 1 - Energy Sources"},"Vote 1","Energy Sources"]
[{"$f":"B13&\" - \"& C13","v":"Vote 2 - Community and Social Services"},1.1000000000000001,"Electricity",{"$f":"CONCATENATE(B3, \" - \", C3)","v":"1.1 - Electricity"}]
[{"$f":"B24&\" - \"&C24","v":"Vote 3 - Finance & Administration"},1.2,"Street Lighting and Signal Systems",{"$f":"CONCATENATE(B4, \" - \", C4)","v":"1.2 - Street Lighting and Signal Systems"}]
[{"$f":"B35&\" - \"&C35","v":"Vote 4 - Planning and Development"},1.3,"[Name of sub-vote]","1.3 - [Name of sub-vote]"]
[{"$f":"B46&\" - \"&C46","v":"Vote 5 - Executive & Council"},1.4,"[Name of sub-vote]","1.4 - [Name of sub-vote]"]
[{"$f":"B57&\" - \"&C57","v":"Vote 6 - Internal Audit"},1.5,"[Name of sub-vote]","1.5 - [Name of sub-vote]"]
[{"$f":"B68&\" - \"&C68","v":"Vote 7 - Road Transport"},1.6,"[Name of sub-vote]","1.6 - [Name of sub-vote]"]
[{"$f":"B79&\" - \"&C79","v":"Vote 8 - Public Safety"},1.7,"[Name of sub-vote]","1.7 - [Name of sub-vote]"]
[{"$f":"B90&\" - \"&C90","v":"Vote 9 - Waste Management"},1.8,"[Name of sub-vote]","1.8 - [Name of sub-vote]"]
[{"$f":"B101&\" - \"&C101","v":"Vote 10 - Sports & Recreation"},1.9,"[Name of sub-vote]","1.9 - [Name of sub-vote]"]
[{"$f":"B112&\" - \"&C112","v":"Vote 11 - Water Management"},"1.10","[Name of sub-vote]","1.10 - [Name of sub-vote]"]
[{"$f":"B123&\" - \"&C123","v":"Vote 12 - Waste Water Management"},"Vote 2","Community and Social Services"]
[{"$f":"B134&\" - \"&C134","v":"Vote 13 - Housing"},2.1,"Animal Care and Diseases",{"$f":"CONCATENATE(B14, \" - \", C14)","v":"2.1 - Animal Care and Diseases"}]
[{"$f":"B145&\" - \"&C145","v":"Vote 14 - Finance & Administration"},2.2000000000000002,"Community Halls and Facilities",{"$f":"CONCATENATE(B15, \" - \", C15)","v":"2.2 - Community Halls and Facilities"}]
[{"$f":"B156&\" - \"&C156","v":"Vote 15 - [NAME OF VOTE 5]"},2.2999999999999998,"Libraries and Archives","2.3 - Libraries and Archives"]
[null,2.4,"Cemeteries, Funeral Parlours and Crematoriums","2.4 - Cemeteries, Funeral Parlours and Crematoriums"]
[null,2.5,"Disaster Management","2.5 - Disaster Management"]
[null,2.6,"[Name of sub-vote]","2.6 - [Name of sub-vote]"]
[null,2.7,"[Name of sub-vote]","2.7 - [Name of sub-vote]"]
[null,2.8,"[Name of sub-vote]","2.8 - [Name of sub-vote]"]
[null,2.9,"[Name of sub-vote]","2.9 - [Name of sub-vote]"]
[null,"2.10","[Name of sub-vote]","2.10 - [Name of sub-vote]"]
[null,"Vote 3","Finance & Administration"]
[null,3.1,"Fleet Management",{"$f":"CONCATENATE(B25, \" - \", C25)","v":"3.1 - Fleet Management"}]
[null,3.2,"Finance",{"$f":"CONCATENATE(B26, \" - \", C26)","v":"3.2 - Finance"}]
[null,3.3,"Asset Management","3.3 - Asset Management"]
[null,3.4,"Human Resources","3.4 - Human Resources"]
[null,3.5,"Legal Services","3.5 - Legal Services"]
[null,3.6,"Property Services","3.6 - Property Services"]
[null,3.7,"Risk Management","3.7 - Risk Management"]
[null,3.8,"Supply Chain Management","3.8 - Supply Chain Management"]
[null,3.9,"[Name of sub-vote]","3.9 - [Name of sub-vote]"]
[null,"3.10","[Name of sub-vote]","3.10 - [Name of sub-vote]"]
[null,"Vote 4","Planning and Development"]
[null,4.0999999999999996,"Town Planning, Building Regulations and Enforcement, and City Engineer",{"$f":"CONCATENATE(B36, \" - \", C36)","v":"4.1 - Town Planning, Building Regulations and Enforcement, and City Engineer"}]
[null,4.2,"Corporate Wide Strategic Planning (IDPs, LEDs)",{"$f":"CONCATENATE(B37, \" - \", C37)","v":"4.2 - Corporate Wide Strategic Planning (IDPs, LEDs)"}]
[null,4.3,"Economic Development/Planning","4.3 - Economic Development/Planning"]
[null,4.4000000000000004,"Project Management Unit","4.4 - Project Management Unit"]
[null,4.5,"[Name of sub-vote]","4.5 - [Name of sub-vote]"]
[null,4.5999999999999996,"[Name of sub-vote]","4.6 - [Name of sub-vote]"]
[null,4.7,"[Name of sub-vote]","4.7 - [Name of sub-vote]"]
[null,4.8,"[Name of sub-vote]","4.8 - [Name of sub-vote]"]
[null,4.9000000000000004,"[Name of sub-vote]","4.9 - [Name of sub-vote]"]
[null,"4.10","[Name of sub-vote]","4.10 - [Name of sub-vote]"]
[null,"Vote 5","Executive & Council"]
[null,5.0999999999999996,"Municipal Manager, Town Secretary and Chief Executive",{"$f":"CONCATENATE(B47, \" - \", C47)","v":"5.1 - Municipal Manager, Town Secretary and Chief Executive"}]
[null,5.2,"Mayor and Council",{"$f":"CONCATENATE(B48, \" - \", C48)","v":"5.2 - Mayor and Council"}]
[null,5.3,"[Name of sub-vote]","5.3 - [Name of sub-vote]"]
[null,5.4,"[Name of sub-vote]","5.4 - [Name of sub-vote]"]
[null,5.5,"[Name of sub-vote]","5.5 - [Name of sub-vote]"]
[null,5.6,"[Name of sub-vote]","5.6 - [Name of sub-vote]"]
[null,5.7,"[Name of sub-vote]","5.7 - [Name of sub-vote]"]
[null,5.8,"[Name of sub-vote]","5.8 - [Name of sub-vote]"]
[null,5.9,"[Name of sub-vote]","5.9 - [Name of sub-vote]"]
[null,"5.10","[Name of sub-vote]","5.10 - [Name of sub-vote]"]
[null,"Vote 6","Internal Audit"]
[null,6.1,"Governance Function",{"$f":"CONCATENATE(B58, \" - \", C58)","v":"6.1 - Governance Function"}]
[null,6.2,"[Name of sub-vote]",{"$f":"CONCATENATE(B59, \" - \", C59)","v":"6.2 - [Name of sub-vote]"}]
[null,6.3,"[Name of sub-vote]","6.3 - [Name of sub-vote]"]
[null,6.4,"[Name of sub-vote]","6.4 - [Name of sub-vote]"]
[null,6.5,"[Name of sub-vote]","6.5 - [Name of sub-vote]"]
[null,6.6,"[Name of sub-vote]","6.6 - [Name of sub-vote]"]
[null,6.7,"[Name of sub-vote]","6.7 - [Name of sub-vote]"]
[null,6.8,"[Name of sub-vote]","6.8 - [Name of sub-vote]"]
[null,6.9,"[Name of sub-vote]","6.9 - [Name of sub-vote]"]
[null,"6.10","[Name of sub-vote]","6.10 - [Name of sub-vote]"]
[null,"Vote 7","Road Transport"]
[null,7.1,"Taxi Ranks",{"$f":"CONCATENATE(B69, \" - \", C69)","v":"7.1 - Taxi Ranks"}]
[null,7.2,"Road and Traffic Regulation",{"$f":"CONCATENATE(B70, \" - \", C70)","v":"7.2 - Road and Traffic Regulation"}]
[null,7.3,"Public Transport","7.3 - Public Transport"]
[null,7.4,"Roads","7.4 - Roads"]
[null,7.5,"[Name of sub-vote]","7.5 - [Name of sub-vote]"]
[null,7.6,"[Name of sub-vote]","7.6 - [Name of sub-vote]"]
[null,7.7,"[Name of sub-vote]","7.7 - [Name of sub-vote]"]
[null,7.8,"[Name of sub-vote]","7.8 - [Name of sub-vote]"]
[null,7.9,"[Name of sub-vote]","7.9 - [Name of sub-vote]"]
[null,"7.10","[Name of sub-vote]","7.10 - [Name of sub-vote]"]
[null,"Vote 8","Public Safety"]
[null,8.1,"Cleansing",{"$f":"CONCATENATE(B80, \" - \", C80)","v":"8.1 - Cleansing"}]
[null,8.1999999999999993,"Fencing and Fences",{"$f":"CONCATENATE(B81, \" - \", C81)","v":"8.2 - Fencing and Fences"}]
[null,8.3000000000000007,"[Name of sub-vote]","8.3 - [Name of sub-vote]"]
[null,8.4,"[Name of sub-vote]","8.4 - [Name of sub-vote]"]
[null,8.5,"[Name of sub-vote]","8.5 - [Name of sub-vote]"]
[null,8.6,"[Name of sub-vote]","8.6 - [Name of sub-vote]"]
[null,8.6999999999999993,"[Name of sub-vote]","8.7 - [Name of sub-vote]"]
[null,8.8000000000000007,"[Name of sub-vote]","8.8 - [Name of sub-vote]"]
[null,8.9,"[Name of sub-vote]","8.9 - [Name of sub-vote]"]
[null,"8.10","[Name of sub-vote]","8.10 - [Name of sub-vote]"]
[null,"Vote 9","Waste Management"]
[null,9.1,"Recycling",{"$f":"CONCATENATE(B91, \" - \", C91)","v":"9.1 - Recycling"}]
[null,9.1999999999999993,"Solid Waste Disposal (Landfill Sites)",{"$f":"CONCATENATE(B92, \" - \", C92)","v":"9.2 - Solid Waste Disposal (Landfill Sites)"}]
[null,9.3000000000000007,"Solid Waste Removal","9.3 - Solid Waste Removal"]
[null,9.4,"[Name of sub-vote]","9.4 - [Name of sub-vote]"]
[null,9.5,"[Name of sub-vote]","9.5 - [Name of sub-vote]"]
[null,9.6,"[Name of sub-vote]","9.6 - [Name of sub-vote]"]
[null,9.6999999999999993,"[Name of sub-vote]","9.7 - [Name of sub-vote]"]
[null,9.8000000000000007,"[Name of sub-vote]","9.8 - [Name of sub-vote]"]
[null,9.9,"[Name of sub-vote]","9.9 - [Name of sub-vote]"]
[null,"9.10","[Name of sub-vote]","9.10 - [Name of sub-vote]"]
[null,"Vote 10","Sports & Recreation"]
[null,10.1,"Recreational Facilities",{"$f":"CONCATENATE(B102, \" - \", C102)","v":"10.1 - Recreational Facilities"}]
[null,10.199999999999999,"Sports Grounds and Stadiums",{"$f":"CONCATENATE(B103, \" - \", C103)","v":"10.2 - Sports Grounds and Stadiums"}]
[null,10.3,"[Name of sub-vote]","10.3 - [Name of sub-vote]"]
[null,10.4,"[Name of sub-vote]","10.4 - [Name of sub-vote]"]
[null,10.5,"[Name of sub-vote]","10.5 - [Name of sub-vote]"]
[null,10.6,"[Name of sub-vote]","10.6 - [Name of sub-vote]"]
[null,10.7,"[Name of sub-vote]","10.7 - [Name of sub-vote]"]
[null,10.8,"[Name of sub-vote]","10.8 - [Name of sub-vote]"]
[null,10.9,"[Name of sub-vote]","10.9 - [Name of sub-vote]"]
[null,"10.10","[Name of sub-vote]","10.10 - [Name of sub-vote]"]
[null,"Vote 11","Water Management"]
[null,11.1,"Water Distribution",{"$f":"CONCATENATE(B113, \" - \", C113)","v":"11.1 - Water Distribution"}]
[null,11.2,"[Name of sub-vote]",{"$f":"CONCATENATE(B114, \" - \", C114)","v":"11.2 - [Name of sub-vote]"}]
[null,11.3,"[Name of sub-vote]","11.3 - [Name of sub-vote]"]
[null,11.4,"[Name of sub-vote]","11.4 - [Name of sub-vote]"]
[null,11.5,"[Name of sub-vote]","11.5 - [Name of sub-vote]"]
[null,11.6,"[Name of sub-vote]","11.6 - [Name of sub-vote]"]
[null,11.7,"[Name of sub-vote]","11.7 - [Name of sub-vote]"]
[null,11.8,"[Name of sub-vote]","11.8 - [Name of sub-vote]"]
[null,11.9,"[Name of sub-vote]","11.9 - [Name of sub-vote]"]
[null,"11.10","[Name of sub-vote]","11.10 - [Name of sub-vote]"]
[null,"Vote 12","Waste Water Management"]
[null,12.1,"Sewerage",{"$f":"CONCATENATE(B124, \" - \", C124)","v":"12.1 - Sewerage"}]
[null,12.2,"[Name of sub-vote]",{"$f":"CONCATENATE(B125, \" - \", C125)","v":"12.2 - [Name of sub-vote]"}]
[null,12.3,"[Name of sub-vote]","12.3 - [Name of sub-vote]"]
[null,12.4,"[Name of sub-vote]","12.4 - [Name of sub-vote]"]
[null,12.5,"[Name of sub-vote]","12.5 - [Name of sub-vote]"]
[null,12.6,"[Name of sub-vote]","12.6 - [Name of sub-vote]"]
[null,12.7,"[Name of sub-vote]","12.7 - [Name of sub-vote]"]
[null,12.8,"[Name of sub-vote]","12.8 - [Name of sub-vote]"]
[null,12.9,"[Name of sub-vote]","12.9 - [Name of sub-vote]"]
[null,"12.10","[Name of sub-vote]","12.10 - [Name of sub-vote]"]
[null,"Vote 13","Housing"]
[null,13.1,"Housing",{"$f":"CONCATENATE(B135, \" - \", C135)","v":"13.1 - Housing"}]
[null,13.2,"[Name of sub-vote]",{"$f":"CONCATENATE(B136, \" - \", C136)","v":"13.2 - [Name of sub-vote]"}]
[null,13.3,"[Name of sub-vote]","13.3 - [Name of sub-vote]"]
[null,13.4,"[Name of sub-vote]","13.4 - [Name of sub-vote]"]
[null,13.5,"[Name of sub-vote]","13.5 - [Name of sub-vote]"]
[null,13.6,"[Name of sub-vote]","13.6 - [Name of sub-vote]"]
[null,13.7,"[Name of sub-vote]","13.7 - [Name of sub-vote]"]
[null,13.8,"[Name of sub-vote]","13.8 - [Name of sub-vote]"]
[null,13.9,"[Name of sub-vote]","13.9 - [Name of sub-vote]"]
[null,"13.10","[Name of sub-vote]","13.10 - [Name of sub-vote]"]
[null,"Vote 14","Finance & Administration"]
[null,14.1,"Security Services",{"$f":"CONCATENATE(B146, \" - \", C146)","v":"14.1 - Security Services"}]
[null,14.2,"Administrative and Corporate Support",{"$f":"CONCATENATE(B147, \" - \", C147)","v":"14.2 - Administrative and Corporate Support"}]
[null,14.3,"Information Technology","14.3 - Information Technology"]
[null,14.4,"[Name of sub-vote]","14.4 - [Name of sub-vote]"]
[null,14.5,"[Name of sub-vote]","14.5 - [Name of sub-vote]"]
[null,14.6,"[Name of sub-vote]","14.6 - [Name of sub-vote]"]
[null,14.7,"[Name of sub-vote]","14.7 - [Name of sub-vote]"]
[null,14.8,"[Name of sub-vote]","14.8 - [Name of sub-vote]"]
[null,14.9,"[Name of sub-vote]","14.9 - [Name of sub-vote]"]
[null,"14.10","[Name of sub-vote]","14.10 - [Name of sub-vote]"]
[null,"Vote 15","[NAME OF VOTE 5]"]
[null,15.1,"[Name of sub-vote]",{"$f":"CONCATENATE(B157, \" - \", C157)","v":"15.1 - [Name of sub-vote]"}]
[null,15.2,"[Name of sub-vote]",{"$f":"CONCATENATE(B158, \" - \", C158)","v":"15.2 - [Name of sub-vote]"}]
[null,15.3,"[Name of sub-vote]","15.3 - [Name of sub-vote]"]
[null,15.4,"[Name of sub-vote]","15.4 - [Name of sub-vote]"]
[null,15.5,"[Name of sub-vote]","15.5 - [Name of sub-vote]"]
[null,15.6,"[Name of sub-vote]","15.6 - [Name of sub-vote]"]
[null,15.7,"[Name of sub-vote]","15.7 - [Name of sub-vote]"]
[null,15.8,"[Name of sub-vote]","15.8 - [Name of sub-vote]"]
[null,15.9,"[Name of sub-vote]","15.9 - [Name of sub-vote]"]
[null,"15.10","[Name of sub-vote]","15.10 - [Name of sub-vote]"]

{"sheet":"Contacts","index":5,"n_rows":140,"n_cols":4,"rows_kept":140,"cut":false,"hidden":false,"merged":[[58,2,58,3],[67,2,67,3],[76,0,76,1],[76,2,76,3],[30,2,30,3],[39,0,39,1],[39,2,39,3],[48,0,48,1],[48,2,48,3],[57,0,57,1],[57,2,57,3],[7,2,7,3],[10,2,10,3],[12,2,12,3],[13,0,13,1],[29,0,29,1],[29,2,29,3],[84,0,84,1],[84,2,84,3],[92,0,92,1],[92,2,92,3],[100,0,100,1],[100,2,100,3],[132,0,132,1],[132,2,132,3],[108,0,108,1],[108,2,108,3],[116,0,116,1],[116,2,116,3],[124,0,124,1],[124,2,124,3]]}
[{"$f":"muni&\" - \"&\" Contact Information\"","v":"LIM331 Greater Giyani -  Contact Information"}]
[]
["A. GENERAL INFORMATION"]
["Municipality",{"$f":"muni","v":"LIM331 Greater Giyani"},"Set name on 'Instructions' sheet"]
[]
["Grade",3,"1 Grade in terms of the Remuneration of Public Office Bearers Act."]
[]
["Province",{"$f":"IF(B4>\" \",VLOOKUP(B4,'Lookup and lists'!B28:C311,2, FALSE),\" \")","v":"LIM LIMPOPO"}]
[]
["Web Address","www.greatergiyani.gov.za"]
[]
["e-mail Address","Chaukemm@greatergiyani.gov.za"]
[]
["B. CONTACT INFORMATION"]
["Postal address:"]
["P.O. Box","Private   Bag  x 9559"]
["City / Town","Giyani"]
["Postal Code",826]
[]
["Street address"]
["Building","Greater Giyani Municipality"]
["Street No. & Name","BA 59 CIVIC CENTRE"]
["City / Town","GIYANI"]
["Postal Code",826]
[]
["General Contacts"]
["Telephone number","015 811 5500"]
["Fax number","015 812 0268"]
[]
["C. POLITICAL LEADERSHIP"]
["Speaker:",null,"Secretary/PA to the Speaker:"]
["ID Number","7303105337084'","ID Number",7503031090083]
["Title","Mr","Title","Mrs"]
["Name","MP HLUNGWANI","Name","B S NOVELA"]
["Telephone number","015 811 5500","Telephone number","015 811 5551"]
["Cell number","083 748 5962","Cell number","076 812 6319"]
["Fax number","015 812 0268","Fax number","086 766 9371"]
["E-mail address","hlungwanimp@greatergiyani.gov.za","E-mail address","chabalalasb@greatergiyani.gov.za"]
[]
["Mayor/Executive Mayor:",null,"Secretary/PA to the Mayor/Executive Mayor:"]
["ID Number",7106020422083,"ID Number","8506200671087"]
["Title","Mrs","Title","Mrs"]
["Name","BA SHIVAMBU","Name"," M H MABASA"]
["Telephone number","015 811 5500","Telephone number","015 811 5500"]
["Cell number","078 906 1676","Cell number","078 698 0156"]
["Fax number","015 812 0268","Fax number","015 812 0268"]
["E-mail address","shivambuba@greatergiyani.gov.za","E-mail address","mabasamh@greatergiyani.gov.za"]
[null," "]
["Deputy Mayor/Executive Mayor:",null,"Secretary/PA to the Deputy Mayor/Executive Mayor:"]
["ID Number",null,"ID Number"]
["Title",null,"Title"]
["Name",null,"Name"]
["Telephone number",null,"Telephone number"]
["Cell number",null,"Cell number"]
["Fax number",null,"Fax number"]
["E-mail address",null,"E-mail address"]
[]
["D. MANAGEMENT LEADERSHIP"]
["Municipal Manager:",null,"Secretary/PA to the Municipal Manager:"]
["ID Number","751115 5310 088","ID Number","800310 0995 089"]
["Title","Mr","Title","Ms"]
["Name","MM CHAUKE","Name","R B NGUNYULE"]
["Telephone number","015 811 5541","Telephone number","015 811 5542"]
["Cell number","0832756934","Cell number","076 812 6020"]
["Fax number","015 812 0268","Fax number","015 812 0268"]
["E-mail address","ChaukeMM@greatergiyani.gov.za","E-mail address","ngunyulerb@greatergiyani.gov.za"]
[]
["Chief Financial Officer",null,"Secretary/PA to the Chief Financial Officer"]
["ID Number",8704035565083,"ID Number",8107250771081]
["Title","Mr","Title","Mrs"]
["Name","NKUNA F","Name","MP Hlengani"]
["Telephone number","015 811 5612","Telephone number","015 811 5594"]
["Cell number","065 103 1395","Cell number","076 522 6432"]
["Fax number","015 811 0268","Fax number","015 812 0622"]
["E-mail address","nkunaf@greatergiyani.gov.za","E-mail address","hlenganimp@greatergiyani.gov.za"]
[]
["Official responsible for submitting financial information",null,"Official responsible for submitting financial information"]
["ID Number",8209160951082,"ID Number",8707145666089]
["Title","Mrs","Title","Mr"]
["Name","N Mashau","Name","M W Maswanganyi"]
["Telephone number","015 811 5520","Telephone number","015 811 5606"]
["Cell number","076 522 0295","Cell number","073 952 2170"]
["Fax number","086 759 8942","Fax number","015 812 0268"]
["E-mail address","mashaun@greatergiyani.gov.za","E-mail address","maswanganyiw@greatergiyani.gov.za"]
["Official responsible for submitting financial information",null,"Official responsible for submitting financial information"]
["ID Number",null,"ID Number"]
["Title",null,"Title"]
["Name",null,"Name"]
["Telephone number",null,"Telephone number"]
["Cell number",null,"Cell number"]
["Fax number",null,"Fax number"]
["E-mail address",null,"E-mail address"]
["Official responsible for submitting financial information",null,"Official responsible for submitting financial information"]
["ID Number",null,"ID Number"]
["Title",null,"Title"]
["Name",null,"Name"]
["Telephone number",null,"Telephone number"]
["Cell number",null,"Cell number"]
["Fax number",null,"Fax number"]
["E-mail address",null,"E-mail address"]
["Official responsible for submitting financial information",null,"Official responsible for submitting financial information"]
["ID Number",null,"ID Number"]
["Title",null,"Title"]
["Name",null,"Name"]
["Telephone number",null,"Telephone number"]
["Cell number",null,"Cell number"]
["Fax number",null,"Fax number"]
["E-mail address",null,"E-mail address"]
["Official responsible for submitting financial information",null,"Official responsible for submitting financial information"]
["ID Number",null,"ID Number"]
["Title",null,"Title"]
["Name",null,"Name"]
["Telephone number",null,"Telephone number"]
["Cell number",null,"Cell number"]
["Fax number",null,"Fax number"]
["E-mail address",null,"E-mail address"]
["Official responsible for submitting financial information",null,"Official responsible for submitting financial information"]
["ID Number",null,"ID Number"]
["Title",null,"Title"]
["Name",null,"Name"]
["Telephone number",null,"Telephone number"]
["Cell number",null,"Cell number"]
["Fax number",null,"Fax number"]
["E-mail address",null,"E-mail address"]
["Official responsible for submitting financial information",null,"Official responsible for submitting financial information"]
["ID Number",null,"ID Number"]
["Title",null,"Title"]
["Name",null,"Name"]
["Telephone number",null,"Telephone number"]
["Cell number",null,"Cell number"]
["Fax number",null,"Fax number"]
["E-mail address",null,"E-mail address"]
["Official responsible for submitting financial information"]
["ID Number"]
["Title"]
["Name"]
["Telephone number"]
["Cell number"]
["Fax number"]
["E-mail address"]

{"sheet":"C1-Sum","index":6,"n_rows":52,"n_cols":10,"rows_kept":52,"cut":false,"hidden":false,"merged":[[54,0,54,9],[1,0,2,0],[1,2,1,9]]}
[{"$f":"muni& \" - \"&s71sum& \" - \"&date","v":"LIM331 Greater Giyani - Table C1 Monthly Budget Statement Summary - M01 July"}]
[{"$f":"desc","v":"Description"},{"$f":"Head1","v":"2018/19"},{"$f":"Head2","v":"Budget Year 2019/20"}]
[null,{"$f":"Head5","v":"Audited Outcome"},{"$f":"Head6","v":"Original Budget"},{"$f":"Head7","v":"Adjusted Budget"},{"$f":"Head38","v":"Monthly actual"},{"$f":"Head39","v":"YearTD actual"},{"$f":"Head40","v":"YearTD budget"},{"$f":"Head41","v":"YTD variance"},{"$f":"Head41","v":"YTD variance"},{"$f":"Head8","v":"Full Year Forecast"}]
["R thousands",null,null,null,null,null,null,null,"%"]
["Financial Performance"]
["Property rates",{"$f":"SUM('C4-FinPerf RE'!C6:C6)","v":40659276.989999995},{"$f":"SUM('C4-FinPerf RE'!D6:D6)","v":39976000},{"$f":"SUM('C4-FinPerf RE'!E6:E6)","v":0},{"$f":"SUM('C4-FinPerf RE'!F6:F6)","v":3575509.5799999996},{"$f":"SUM('C4-FinPerf RE'!G6:G6)","v":3575509.5799999996},{"$f":"SUM('C4-FinPerf RE'!H6:H6)","v":3331333.333333333},{"$f":"F6-G6","v":244176.24666666659},{"$f":"IF(H6=0,\"\",H6/G6)","v":7.3296852111266741E-2},{"$f":"SUM('C4-FinPerf RE'!K6:K6)","v":39976000}]
["Service charges",{"$f":"SUM('C4-FinPerf RE'!C7:C10)","v":4477862.1399999997},{"$f":"SUM('C4-FinPerf RE'!D7:D10)","v":5400000},{"$f":"SUM('C4-FinPerf RE'!E7:E10)","v":0},{"$f":"SUM('C4-FinPerf RE'!F7:F10)","v":406533.39999999991},{"$f":"SUM('C4-FinPerf RE'!G7:G10)","v":406533.39999999991},{"$f":"SUM('C4-FinPerf RE'!H7:H10)","v":450000},{"$f":"F7-G7","v":-43466.600000000093},{"$f":"IF(H7=0,\"\",H7/G7)","v":-9.6592444444444647E-2},{"$f":"SUM('C4-FinPerf RE'!K7:K10)","v":5400000}]
["Investment revenue",{"$f":"'C4-FinPerf RE'!C13","v":5234951.3800000008},{"$f":"'C4-FinPerf RE'!D13","v":5000000},{"$f":"'C4-FinPerf RE'!E13","v":0},{"$f":"'C4-FinPerf RE'!F13","v":321171.17},{"$f":"'C4-FinPerf RE'!G13","v":321171.17},{"$f":"'C4-FinPerf RE'!H13","v":416666.66666666663},{"$f":"F8-G8","v":-95495.496666666644},{"$f":"IF(H8=0,\"\",H8/G8)","v":-0.22918919199999996},{"$f":"'C4-FinPerf RE'!K13","v":5000000}]
["Transfers and subsidies",{"$f":"'C4-FinPerf RE'!C19","v":259208395.21000001},{"$f":"'C4-FinPerf RE'!D19","v":303024000},{"$f":"'C4-FinPerf RE'!E19","v":0},{"$f":"'C4-FinPerf RE'!F19","v":123674000},{"$f":"'C4-FinPerf RE'!G19","v":123674000},{"$f":"'C4-FinPerf RE'!H19","v":101008000},{"$f":"F9-G9","v":22666000},{"$f":"IF(H9=0,\"\",H9/G9)","v":0.22439806747980359},{"$f":"'C4-FinPerf RE'!K19","v":303024000}]
["Other own revenue",{"$f":"'C4-FinPerf RE'!C12+'C4-FinPerf RE'!C14+'C4-FinPerf RE'!C15+'C4-FinPerf RE'!C16+'C4-FinPerf RE'!C17+'C4-FinPerf RE'!C18+'C4-FinPerf RE'!C20+'C4-FinPerf RE'!C21","v":36596611.489999995},{"$f":"'C4-FinPerf RE'!D12+'C4-FinPerf RE'!D14+'C4-FinPerf RE'!D15+'C4-FinPerf RE'!D16+'C4-FinPerf RE'!D17+'C4-FinPerf RE'!D18+'C4-FinPerf RE'!D20+'C4-FinPerf RE'!D21","v":22973000},{"$f":"'C4-FinPerf RE'!E12+'C4-FinPerf RE'!E14+'C4-FinPerf RE'!E15+'C4-FinPerf RE'!E16+'C4-FinPerf RE'!E17+'C4-FinPerf RE'!E18+'C4-FinPerf RE'!E20+'C4-FinPerf RE'!E21","v":0},{"$f":"'C4-FinPerf RE'!F12+'C4-FinPerf RE'!F14+'C4-FinPerf RE'!F15+'C4-FinPerf RE'!F16+'C4-FinPerf RE'!F17+'C4-FinPerf RE'!F18+'C4-FinPerf RE'!F20+'C4-FinPerf RE'!F21","v":4218613.4400000004},{"$f":"'C4-FinPerf RE'!G12+'C4-FinPerf RE'!G14+'C4-FinPerf RE'!G15+'C4-FinPerf RE'!G16+'C4-FinPerf RE'!G17+'C4-FinPerf RE'!G18+'C4-FinPerf RE'!G20+'C4-FinPerf RE'!G21","v":4218613.4400000004},{"$f":"'C4-FinPerf RE'!H12+'C4-FinPerf RE'!H14+'C4-FinPerf RE'!H15+'C4-FinPerf RE'!H16+'C4-FinPerf RE'!H17+'C4-FinPerf RE'!H18+'C4-FinPerf RE'!H20+'C4-FinPerf RE'!H21","v":1914416.6666666667},{"$f":"F10-G10","v":2304196.7733333334},{"$f":"IF(H10=0,\"\",H10/G10)","v":1.2036025455970052},{"$f":"'C4-FinPerf RE'!K12+'C4-FinPerf RE'!K14+'C4-FinPerf RE'!K15+'C4-FinPerf RE'!K16+'C4-FinPerf RE'!K17+'C4-FinPerf RE'!K18+'C4-FinPerf RE'!K20+'C4-FinPerf RE'!K21","v":22973000}]
["Total Revenue (excluding capital transfers and contributions)",{"$f":"SUM(B6:B10)","v":346177097.21000004},376373000,0,132195827.59,132195827.59,107120416.66666667,{"$f":"F11-G11","v":25075410.923333332},{"$f":"IF(H11=0,\"\",H11/G11)","v":0.23408619667119165},376373000]
["Employee costs",{"$f":"'C4-FinPerf RE'!C25","v":130474394.06999998},{"$f":"'C4-FinPerf RE'!D25","v":164551019.84000012},{"$f":"'C4-FinPerf RE'!E25","v":0},{"$f":"'C4-FinPerf RE'!F25","v":11004917.579999985},{"$f":"'C4-FinPerf RE'!G25","v":11004917.579999985},{"$f":"'C4-FinPerf RE'!H25","v":13712584.986666676},-2707667.4066666905,-0.1974585688474835,{"$f":"'C4-FinPerf RE'!K25","v":164551019.84000012}]
["Remuneration of Councillors",{"$f":"'C4-FinPerf RE'!C26","v":22755072.120000005},{"$f":"'C4-FinPerf RE'!D26","v":23922552.370000001},{"$f":"'C4-FinPerf RE'!E26","v":0},{"$f":"'C4-FinPerf RE'!F26","v":1877888.67},{"$f":"'C4-FinPerf RE'!G26","v":1877888.67},{"$f":"'C4-FinPerf RE'!H26","v":1993546.0308333333},-115657.36083333334,-5.8015896821297257E-2,{"$f":"'C4-FinPerf RE'!K26","v":23922552.370000001}]
["Depreciation & asset impairment",{"$f":"'C4-FinPerf RE'!C28","v":86419067.38000001},{"$f":"'C4-FinPerf RE'!D28","v":30000000},{"$f":"'C4-FinPerf RE'!E28","v":0},{"$f":"'C4-FinPerf RE'!F28","v":0},{"$f":"'C4-FinPerf RE'!G28","v":0},{"$f":"'C4-FinPerf RE'!H28","v":2500000},-2500000,-1,{"$f":"'C4-FinPerf RE'!K28","v":30000000}]
["Finance charges",{"$f":"'C4-FinPerf RE'!C29","v":294856.32000000001},{"$f":"'C4-FinPerf RE'!D29","v":0},{"$f":"'C4-FinPerf RE'!E29","v":0},{"$f":"'C4-FinPerf RE'!F29","v":0},{"$f":"'C4-FinPerf RE'!G29","v":0},{"$f":"'C4-FinPerf RE'!H29","v":0},0,"",{"$f":"'C4-FinPerf RE'!K29","v":0}]
["Materials and bulk purchases",{"$f":"SUM('C4-FinPerf RE'!C30:C31)","v":4680660.95},{"$f":"SUM('C4-FinPerf RE'!D30:D31)","v":9000000},{"$f":"SUM('C4-FinPerf RE'!E30:E31)","v":0},{"$f":"SUM('C4-FinPerf RE'!F30:F31)","v":391859.10000000003},{"$f":"SUM('C4-FinPerf RE'!G30:G31)","v":391859.10000000003},{"$f":"SUM('C4-FinPerf RE'!H30:H31)","v":750000},-358140.89999999997,-0.47752119999999998,{"$f":"SUM('C4-FinPerf RE'!K30:K31)","v":9000000}]
["Transfers and subsidies",{"$f":"'C4-FinPerf RE'!C33","v":22363.95},{"$f":"'C4-FinPerf RE'!D33","v":1000000},{"$f":"'C4-FinPerf RE'!E33","v":0},{"$f":"'C4-FinPerf RE'!F33","v":0},{"$f":"'C4-FinPerf RE'!G33","v":0},{"$f":"'C4-FinPerf RE'!H33","v":83333.333333333328},-83333.333333333328,-1,{"$f":"'C4-FinPerf RE'!K33","v":1000000}]
["Other expenditure",{"$f":"'C4-FinPerf RE'!C36-SUM('C1-Sum'!B12:B17)","v":146392539.18000001},{"$f":"'C4-FinPerf RE'!D36-SUM('C1-Sum'!C12:C17)","v":143717167.23000005},{"$f":"'C4-FinPerf RE'!E36-SUM('C1-Sum'!D12:D17)","v":0},{"$f":"'C4-FinPerf RE'!F36-SUM('C1-Sum'!E12:E17)","v":1378833.1999999993},{"$f":"'C4-FinPerf RE'!G36-SUM('C1-Sum'!F12:F17)","v":1378833.1999999993},{"$f":"'C4-FinPerf RE'!H36-SUM('C1-Sum'!G12:G17)","v":11976430.602499995},-10597597.402499996,-0.8848711067793289,{"$f":"'C4-FinPerf RE'!K36-SUM('C1-Sum'!J12:J17)","v":143717167.23000005}]
["Total Expenditure",{"$f":"SUM(B12:B18)","v":391038953.96999997},372190739.44000018,0,14653498.549999984,14653498.549999984,31015894.953333337,-16362396.403333353,-0.52754874324768941,{"$f":"SUM(J12:J18)","v":372190739.44000018}]
["Surplus/(Deficit)",{"$f":"B11-B19","v":-44861856.759999931},4182260.5599998236,0,117542329.04000002,117542329.04000002,76104521.713333338,41437807.326666683,0.54448548382910178,{"$f":"J11-J19","v":4182260.5599998236}]
[{"$f":"'C4-FinPerf RE'!A39","v":"Transfers and subsidies - capital (monetary allocations) (National / Provincial and District)"},{"$f":"'C4-FinPerf RE'!C39","v":73177035},{"$f":"'C4-FinPerf RE'!D39","v":60688000},{"$f":"'C4-FinPerf RE'!E39","v":0},{"$f":"'C4-FinPerf RE'!F39","v":24275000},{"$f":"'C4-FinPerf RE'!G39","v":24275000},{"$f":"'C4-FinPerf RE'!H39","v":20229333},4045667,0.19999013313983213,{"$f":"'C4-FinPerf RE'!K39","v":60688000}]
["Contributions & Contributed assets",{"$f":"SUM('C4-FinPerf RE'!C40:C41)","v":0},{"$f":"SUM('C4-FinPerf RE'!D40:D41)","v":0},{"$f":"SUM('C4-FinPerf RE'!E40:E41)","v":0},{"$f":"SUM('C4-FinPerf RE'!F40:F41)","v":0},{"$f":"SUM('C4-FinPerf RE'!G40:G41)","v":0},{"$f":"SUM('C4-FinPerf RE'!H40:H41)","v":0},0,"",{"$f":"SUM('C4-FinPerf RE'!K40:K41)","v":0}]
["Surplus/(Deficit) after capital transfers & contributions",{"$f":"B20+B21+B22","v":28315178.240000069},64870260.559999824,0,141817329.04000002,141817329.04000002,96333854.713333338,45483474.326666683,0.47214423695610119,{"$f":"J20+J21+J22","v":64870260.559999824}]
["Share of surplus/ (deficit) of associate",{"$f":"'C4-FinPerf RE'!C47","v":0},{"$f":"'C4-FinPerf RE'!D47","v":0},{"$f":"'C4-FinPerf RE'!E47","v":0},{"$f":"'C4-FinPerf RE'!F47","v":0},{"$f":"'C4-FinPerf RE'!G47","v":0},{"$f":"'C4-FinPerf RE'!H47","v":0},0,"",{"$f":"'C4-FinPerf RE'!K47","v":0}]
["Surplus/ (Deficit) for the year",{"$f":"B23+B24","v":28315178.240000069},64870260.559999824,0,141817329.04000002,141817329.04000002,96333854.713333338,45483474.326666683,0.47214423695610119,{"$f":"J23+J24","v":64870260.559999824}]
[]
["Capital expenditure & funds sources"]
["Capital expenditure",{"$f":"'C5-Capex'!C40","v":64464111},{"$f":"'C5-Capex'!D40","v":109870266},{"$f":"'C5-Capex'!E40","v":0},{"$f":"'C5-Capex'!F40","v":0},{"$f":"'C5-Capex'!G40","v":0},{"$f":"'C5-Capex'!H40","v":9155855.5},{"$f":"F28-G28","v":-9155855.5},{"$f":"IF(H28=0,\"\",H28/G28)","v":-1},{"$f":"'C5-Capex'!K40","v":109870266}]
["Capital transfers recognised",{"$f":"'C5-Capex'!C70","v":54706118},{"$f":"'C5-Capex'!D70","v":57653600},{"$f":"'C5-Capex'!E70","v":0},{"$f":"'C5-Capex'!F70","v":0},{"$f":"'C5-Capex'!G70","v":0},{"$f":"'C5-Capex'!H70","v":4804466.666666666},-4804466.666666666,-1,{"$f":"'C5-Capex'!K70","v":57653600}]
[]
["Borrowing",{"$f":"'C5-Capex'!C72","v":0},{"$f":"'C5-Capex'!D72","v":0},{"$f":"'C5-Capex'!E72","v":0},{"$f":"'C5-Capex'!F72","v":0},{"$f":"'C5-Capex'!G72","v":0},{"$f":"'C5-Capex'!H72","v":0},0,"",{"$f":"'C5-Capex'!K72","v":0}]
["Internally generated funds",{"$f":"'C5-Capex'!C73","v":9757993},{"$f":"'C5-Capex'!D73","v":52216666},{"$f":"'C5-Capex'!E73","v":0},{"$f":"'C5-Capex'!F73","v":0},{"$f":"'C5-Capex'!G73","v":0},{"$f":"'C5-Capex'!H73","v":4351388.833333333},-4351388.833333333,-1,{"$f":"'C5-Capex'!K73","v":52216666}]
["Total sources of capital funds",{"$f":"+B29+B31+B32","v":64464111},109870266,0,0,0,9155855.5,-9155855.5,-1,{"$f":"+J29+J31+J32","v":109870266}]
[]
["Financial position"]
["Total current assets",{"$f":"'C6-FinPos'!C13","v":138718609},{"$f":"'C6-FinPos'!D13","v":98835533.60349983},{"$f":"'C6-FinPos'!E13","v":0},null,{"$f":"'C6-FinPos'!F13","v":302101741.98000002},null,null,null,{"$f":"'C6-FinPos'!G13","v":98835533.6034998}]
["Total non current assets",{"$f":"'C6-FinPos'!C25","v":881304905.06999981},{"$f":"'C6-FinPos'!D25","v":939655516.92999983},{"$f":"'C6-FinPos'!E25","v":0},null,{"$f":"'C6-FinPos'!F25","v":881304905.06999981},null,null,null,{"$f":"'C6-FinPos'!G25","v":939655516.92999983}]
["Total current liabilities",{"$f":"'C6-FinPos'!C35","v":74325502},{"$f":"'C6-FinPos'!D35","v":118369347.06},{"$f":"'C6-FinPos'!E35","v":0},null,{"$f":"'C6-FinPos'!F35","v":155284435.50999999},null,null,null,{"$f":"'C6-FinPos'!G35","v":118369347.06}]
["Total non current liabilities",{"$f":"'C6-FinPos'!C40","v":50891384.859999999},{"$f":"'C6-FinPos'!D40","v":0},{"$f":"'C6-FinPos'!E40","v":0},null,{"$f":"'C6-FinPos'!F40","v":0},null,null,null,{"$f":"'C6-FinPos'!G40","v":0}]
["Community wealth/Equity",{"$f":"'C6-FinPos'!C48","v":894806627},{"$f":"'C6-FinPos'!D48","v":920121703.47349977},{"$f":"'C6-FinPos'!E48","v":0},null,{"$f":"'C6-FinPos'!F48","v":1028122211.54},null,null,null,{"$f":"'C6-FinPos'!G48","v":920121703.47349977}]
[]
["Cash flows"]
["Net cash from (used) operating",{"$f":"'C7-CFlow'!C18","v":91383894},{"$f":"'C7-CFlow'!D18","v":91619860.559999824},{"$f":"'C7-CFlow'!E18","v":0},{"$f":"'C7-CFlow'!F18","v":136554999.79000002},{"$f":"'C7-CFlow'!G18","v":136554999.79000002},{"$f":"'C7-CFlow'!H18","v":7634988.3799999878},{"$f":"G43-F43","v":-128920011.41000003},{"$f":"IF(H43=0,\"\",H43/G43)","v":-16.885423394711207},{"$f":"'C7-CFlow'!K18","v":91619860.559999824}]
["Net cash from (used) investing",{"$f":"'C7-CFlow'!C28","v":-64464111},{"$f":"'C7-CFlow'!D28","v":-109870266},{"$f":"'C7-CFlow'!E28","v":0},{"$f":"'C7-CFlow'!F28","v":0},{"$f":"'C7-CFlow'!G28","v":0},{"$f":"'C7-CFlow'!H28","v":-9155855.5},{"$f":"G44-F44","v":-9155855.5},{"$f":"IF(H44=0,\"\",H44/G44)","v":1},{"$f":"'C7-CFlow'!K28","v":-109870266}]
["Net cash from (used) financing",{"$f":"'C7-CFlow'!C37","v":-582652},{"$f":"'C7-CFlow'!D37","v":0},{"$f":"'C7-CFlow'!E37","v":0},{"$f":"'C7-CFlow'!F37","v":-4977903.07},{"$f":"'C7-CFlow'!G37","v":-4977903.07},{"$f":"'C7-CFlow'!H37","v":0},{"$f":"G45-F45","v":4977903.07},{"$f":"IF(H45=0,\"\",H45/G45)","v":{"$error":"#DIV/0!"}},{"$f":"'C7-CFlow'!K37","v":0}]
["Cash/cash equivalents at the month/year end",{"$f":"'C7-CFlow'!C41","v":40759295},{"$f":"'C7-CFlow'!D41","v":22508894.559999824},{"$f":"'C7-CFlow'!E41","v":0},{"$f":"'C7-CFlow'!F41","v":0},{"$f":"'C7-CFlow'!G41","v":172336396.72000003},{"$f":"'C7-CFlow'!H41","v":39238432.879999988},{"$f":"G46-F46","v":-133097963.84000003},{"$f":"IF(H46=0,\"\",H46/G46)","v":-3.3920305697998629},{"$f":"'C7-CFlow'!K41","v":22508894.559999824}]
[]
["Debtors & creditors analysis",{"$f":"'SC3'!C3","v":"0-30 Days"},{"$f":"'SC3'!D3","v":"31-60 Days"},{"$f":"'SC3'!E3","v":"61-90 Days"},{"$f":"'SC3'!F3","v":"91-120 Days"},{"$f":"'SC3'!G3","v":"121-150 Dys"},{"$f":"'SC3'!H3","v":"151-180 Dys"},{"$f":"'SC3'!I3","v":"181 Dys-1 Yr"},{"$f":"'SC3'!J3","v":"Over 1Yr"},"Total"]
[{"$f":"LEFT('SC3'!A4,20)","v":"Debtors Age Analysis"}]
[{"$f":"'SC3'!A14","v":"Total By Income Source"},{"$f":"'SC3'!C14","v":5591591.4400000107},{"$f":"'SC3'!D14","v":4686571.1900000321},{"$f":"'SC3'!E14","v":4673757.3000000324},{"$f":"'SC3'!F14","v":4418973.150000033},{"$f":"'SC3'!G14","v":4527457.1600000337},{"$f":"'SC3'!H14","v":4264799.2600000305},{"$f":"'SC3'!I14","v":30124956.910000097},{"$f":"'SC3'!J14","v":166991783.58000076},{"$f":"'SC3'!K14","v":225279889.99000102}]
[{"$f":"LEFT('SC4'!A5,22)","v":"Creditors Age Analysis"}]
["Total Creditors",{"$f":"'SC4'!C15","v":-6447648},{"$f":"'SC4'!D15","v":8175886},{"$f":"'SC4'!E15","v":-1666615},{"$f":"'SC4'!F15","v":1666615},{"$f":"'SC4'!G15","v":65573},{"$f":"'SC4'!H15","v":-67415},{"$f":"'SC4'!I15","v":-682646},{"$f":"'SC4'!J15","v":682646},{"$f":"'SC4'!K15","v":1726396}]

{"sheet":"C2-FinPerf SC","index":7,"n_rows":55,"n_cols":11,"rows_kept":55,"cut":false,"hidden":false,"merged":[[1,1,2,1],[1,0,2,0],[0,0,0,10],[54,0,54,10]]}
[{"$f":"muni& \" - \"&S71A& \" - \"&date","v":"LIM331 Greater Giyani - Table C2 Monthly Budget Statement - Financial Performance (functional classification) - M01 July"}]
[{"$f":"desc","v":"Description"},{"$f":"head27","v":"Ref"},{"$f":"Head1","v":"2018/19"},{"$f":"Head2","v":"Budget Year 2019/20"}]
[null,null,{"$f":"Head5","v":"Audited Outcome"},{"$f":"Head6","v":"Original Budget"},{"$f":"Head7","v":"Adjusted Budget"},{"$f":"Head38","v":"Monthly actual"},{"$f":"Head39","v":"YearTD actual"},{"$f":"Head40","v":"YearTD budget"},{"$f":"Head41","v":"YTD variance"},{"$f":"Head41","v":"YTD variance"},{"$f":"Head8","v":"Full Year Forecast"}]
["R thousands",1,null,null,null,null,null,null,null,"%"]
["Revenue - Functional"]
["Governance and administration",null,{"$f":"SUM(C7:C9)","v":392363641.32999998},413436000,0,6156884.3900000006,6156884.3900000006,34453000,{"$f":"G6-H6","v":-28296115.609999999},{"$f":"IF(I6=0,\"\",I6/H6)","v":-0.82129613125126988},{"$f":"SUM(K7:K9)","v":413436000}]
["Executive and council",null,{"$f":"'C2C'!C7","v":0},{"$f":"'C2C'!D7","v":0},{"$f":"'C2C'!E7","v":0},{"$f":"'C2C'!F7","v":0},{"$f":"'C2C'!G7","v":0},{"$f":"'C2C'!H7","v":0},0,{"$f":"IF(I7=0,\"\",I7/H7)","v":""},{"$f":"'C2C'!K7","v":0}]
["Finance and administration",null,{"$f":"'C2C'!C10","v":392363641.32999998},{"$f":"'C2C'!D10","v":413436000},{"$f":"'C2C'!E10","v":0},{"$f":"'C2C'!F10","v":6156884.3900000006},{"$f":"'C2C'!G10","v":6156884.3900000006},{"$f":"'C2C'!H10","v":34453000},-28296115.609999999,-0.82129613125126988,{"$f":"'C2C'!K10","v":413436000}]
["Internal audit",null,{"$f":"'C2C'!C24","v":0},{"$f":"'C2C'!D24","v":0},{"$f":"'C2C'!E24","v":0},{"$f":"'C2C'!F24","v":0},{"$f":"'C2C'!G24","v":0},{"$f":"'C2C'!H24","v":0},0,"",{"$f":"'C2C'!K24","v":0}]
["Community and public safety",null,{"$f":"SUM(C11:C15)","v":1252111.6099999999},1543000,0,103195.84,103195.84,128583.33333333334,-25387.493333333347,-0.19744000000000009,{"$f":"SUM(K11:K15)","v":1543000}]
["Community and social services",null,{"$f":"'C2C'!C27","v":449493.35000000003},{"$f":"'C2C'!D27","v":623000},{"$f":"'C2C'!E27","v":0},{"$f":"'C2C'!F27","v":37474.53},{"$f":"'C2C'!G27","v":37474.53},{"$f":"'C2C'!H27","v":51916.666666666672},-14442.136666666673,-0.27817919743178177,{"$f":"'C2C'!K27","v":623000}]
["Sport and recreation",null,{"$f":"'C2C'!C49","v":194131.39},{"$f":"'C2C'!D49","v":220000},{"$f":"'C2C'!E49","v":0},{"$f":"'C2C'!F49","v":3271.31},{"$f":"'C2C'!G49","v":3271.31},{"$f":"'C2C'!H49","v":18333.333333333332},-15062.023333333333,-0.82156490909090907,{"$f":"'C2C'!K49","v":220000}]
["Public safety",null,{"$f":"'C2C'!C55","v":0},{"$f":"'C2C'!D55","v":0},{"$f":"'C2C'!E55","v":0},{"$f":"'C2C'!F55","v":0},{"$f":"'C2C'!G55","v":0},{"$f":"'C2C'!H55","v":0},0,"",{"$f":"'C2C'!K55","v":0}]
["Housing",null,{"$f":"'C2C'!C64","v":608486.87},{"$f":"'C2C'!D64","v":700000},{"$f":"'C2C'!E64","v":0},{"$f":"'C2C'!F64","v":62450},{"$f":"'C2C'!G64","v":62450},{"$f":"'C2C'!H64","v":58333.333333333336},{"$f":"G14-H14","v":4116.6666666666642},{"$f":"IF(I14=0,\"\",I14/H14)","v":7.0571428571428521E-2},{"$f":"'C2C'!K64","v":700000}]
["Health",null,{"$f":"'C2C'!C67","v":0},{"$f":"'C2C'!D67","v":0},{"$f":"'C2C'!E67","v":0},{"$f":"'C2C'!F67","v":0},{"$f":"'C2C'!G67","v":0},{"$f":"'C2C'!H67","v":0},0,"",{"$f":"'C2C'!K67","v":0}]
["Economic and environmental services",null,{"$f":"SUM(C17:C19)","v":21182454.32},16632000,0,1848615.66,1848615.66,1386000,462615.65999999992,0.33377753246753239,{"$f":"SUM(K17:K19)","v":16632000}]
["Planning and development",null,{"$f":"'C2C'!C76","v":822661.72},{"$f":"'C2C'!D76","v":1132000},{"$f":"'C2C'!E76","v":0},{"$f":"'C2C'!F76","v":74454.89},{"$f":"'C2C'!G76","v":74454.89},{"$f":"'C2C'!H76","v":94333.333333333328},-19878.443333333329,-0.21072554770318017,{"$f":"'C2C'!K76","v":1132000}]
["Road transport",null,{"$f":"'C2C'!C87","v":20359792.600000001},{"$f":"'C2C'!D87","v":15500000},{"$f":"'C2C'!E87","v":0},{"$f":"'C2C'!F87","v":1774160.77},{"$f":"'C2C'!G87","v":1774160.77},{"$f":"'C2C'!H87","v":1291666.6666666667},482494.10333333327,0.3735438219354838,{"$f":"'C2C'!K87","v":15500000}]
["Environmental protection",null,{"$f":"'C2C'!C92","v":0},{"$f":"'C2C'!D92","v":0},{"$f":"'C2C'!E92","v":0},{"$f":"'C2C'!F92","v":0},{"$f":"'C2C'!G92","v":0},{"$f":"'C2C'!H92","v":0},0,"",{"$f":"'C2C'!K92","v":0}]
["Trading services",null,{"$f":"SUM(C21:C24)","v":4555924.95},{"$f":"SUM(D21:D24)","v":5450000},0,413131.69999999995,413131.69999999995,454166.66666666669,-41034.966666666733,-9.0352220183486376E-2,{"$f":"SUM(K21:K24)","v":5450000}]
["Energy sources",null,{"$f":"'C2C'!C100","v":0},{"$f":"'C2C'!D100","v":0},{"$f":"'C2C'!E100","v":0},{"$f":"'C2C'!F100","v":0},{"$f":"'C2C'!G100","v":0},{"$f":"'C2C'!H100","v":0},{"$f":"G21-H21","v":0},"",{"$f":"'C2C'!K100","v":0}]
["Water management",null,{"$f":"'C2C'!C104","v":0},{"$f":"'C2C'!D104","v":0},{"$f":"'C2C'!E104","v":0},{"$f":"'C2C'!F104","v":0},{"$f":"'C2C'!G104","v":0},{"$f":"'C2C'!H104","v":0},{"$f":"G22-H22","v":0},"",{"$f":"'C2C'!K104","v":0}]
["Waste water management",null,{"$f":"'C2C'!C108","v":0},{"$f":"'C2C'!D108","v":0},{"$f":"'C2C'!E108","v":0},{"$f":"'C2C'!F108","v":0},{"$f":"'C2C'!G108","v":0},{"$f":"'C2C'!H108","v":0},{"$f":"G23-H23","v":0},"",{"$f":"'C2C'!K108","v":0}]
["Waste management",null,{"$f":"'C2C'!C113","v":4555924.95},{"$f":"'C2C'!D113","v":5450000},{"$f":"'C2C'!E113","v":0},{"$f":"'C2C'!F113","v":413131.69999999995},{"$f":"'C2C'!G113","v":413131.69999999995},{"$f":"'C2C'!H113","v":454166.66666666669},{"$f":"G24-H24","v":-41034.966666666733},-9.0352220183486376E-2,{"$f":"'C2C'!K113","v":5450000}]
["Other",4,{"$f":"'C2C'!C118","v":0},{"$f":"'C2C'!D118","v":0},{"$f":"'C2C'!E118","v":0},{"$f":"'C2C'!F118","v":0},{"$f":"'C2C'!G118","v":0},{"$f":"'C2C'!H118","v":0},{"$f":"G25-H25","v":0},"",{"$f":"'C2C'!K118","v":0}]
["Total Revenue - Functional",2,{"$f":"C6+C10+C16+C20+C25","v":419354132.20999998},{"$f":"D6+D10+D16+D20+D25","v":437061000},0,8521827.5899999999,8521827.5899999999,36421750,-27899922.409999996,-0.76602366470584193,{"$f":"K6+K10+K16+K20+K25","v":437061000}]
[]
["Expenditure - Functional"]
["Governance and administration",null,{"$f":"SUM(C30:C32)","v":273267441.13000005},238034505.92999992,0,8871899.879999999,8871899.879999999,19836208.827499997,{"$f":"G29-H29","v":-10964308.947499998},{"$f":"IF(I29=0,\"\",I29/H29)","v":-0.55274216171285662},{"$f":"SUM(K30:K32)","v":238034505.92999992}]
["Executive and council",null,{"$f":"'C2C'!C129","v":35336748.979999997},{"$f":"'C2C'!D129","v":36481597.609999992},{"$f":"'C2C'!E129","v":0},{"$f":"'C2C'!F129","v":2430642.2799999998},{"$f":"'C2C'!G129","v":2430642.2799999998},{"$f":"'C2C'!H129","v":3040133.1341666658},-609490.85416666605,{"$f":"IF(I30=0,\"\",I30/H30)","v":-0.20048163263538596},{"$f":"'C2C'!K129","v":36481597.609999992}]
["Finance and administration",null,{"$f":"'C2C'!C132","v":235495037.85000005},{"$f":"'C2C'!D132","v":198964333.27999994},{"$f":"'C2C'!E132","v":0},{"$f":"'C2C'!F132","v":6249109.0800000001},{"$f":"'C2C'!G132","v":6249109.0800000001},{"$f":"'C2C'!H132","v":16580361.106666666},-10331252.026666665,-0.62310175032995241,{"$f":"'C2C'!K132","v":198964333.27999994}]
["Internal audit",null,{"$f":"'C2C'!C146","v":2435654.2999999998},{"$f":"'C2C'!D146","v":2588575.04},{"$f":"'C2C'!E146","v":0},{"$f":"'C2C'!F146","v":192148.52},{"$f":"'C2C'!G146","v":192148.52},{"$f":"'C2C'!H146","v":215714.58666666667},-23566.06666666668,-0.1092465142521038,{"$f":"'C2C'!K146","v":2588575.04}]
["Community and public safety",null,{"$f":"SUM(C34:C38)","v":16096280.900000002},19713545.590000004,0,1150643.7,1150643.7,1642795.4658333333,-492151.76583333337,-0.29958188713631601,{"$f":"SUM(K34:K38)","v":19713545.590000004}]
["Community and social services",null,{"$f":"'C2C'!C149","v":8963636.6100000013},{"$f":"'C2C'!D149","v":11309842.530000001},{"$f":"'C2C'!E149","v":0},{"$f":"'C2C'!F149","v":628193.79},{"$f":"'C2C'!G149","v":628193.79},{"$f":"'C2C'!H149","v":942486.87750000006},-314293.08750000002,-0.33347210980133779,{"$f":"'C2C'!K149","v":11309842.530000001}]
["Sport and recreation",null,{"$f":"'C2C'!C171","v":5871099.1800000006},{"$f":"'C2C'!D171","v":7025909.8900000006},{"$f":"'C2C'!E171","v":0},{"$f":"'C2C'!F171","v":427817.93999999994},{"$f":"'C2C'!G171","v":427817.93999999994},{"$f":"'C2C'!H171","v":585492.49083333334},-157674.5508333334,-0.26930243052120906,{"$f":"'C2C'!K171","v":7025909.8900000006}]
["Public safety",null,{"$f":"'C2C'!C177","v":135175},{"$f":"'C2C'!D177","v":100000},{"$f":"'C2C'!E177","v":0},{"$f":"'C2C'!F177","v":0},{"$f":"'C2C'!G177","v":0},{"$f":"'C2C'!H177","v":8333.3333333333339},-8333.3333333333339,-1,{"$f":"'C2C'!K177","v":100000}]
["Housing",null,{"$f":"'C2C'!C186","v":1126370.1100000001},{"$f":"'C2C'!D186","v":1277793.17},{"$f":"'C2C'!E186","v":0},{"$f":"'C2C'!F186","v":94631.97},{"$f":"'C2C'!G186","v":94631.97},{"$f":"'C2C'!H186","v":106482.76416666666},-11850.794166666659,-0.11129307413655992,{"$f":"'C2C'!K186","v":1277793.17}]
["Health",null,{"$f":"'C2C'!C189","v":0},{"$f":"'C2C'!D189","v":0},{"$f":"'C2C'!E189","v":0},{"$f":"'C2C'!F189","v":0},{"$f":"'C2C'!G189","v":0},{"$f":"'C2C'!H189","v":0},0,"",{"$f":"'C2C'!K189","v":0}]
["Economic and environmental services",null,{"$f":"SUM(C40:C42)","v":47946212.57},66319128.799999997,0,3314795.24,3314795.24,5526594.0666666664,-2211798.8266666662,-0.40021011132462275,{"$f":"SUM(K40:K42)","v":66319128.799999997}]
["Planning and development",null,{"$f":"'C2C'!C198","v":18078391.32},{"$f":"'C2C'!D198","v":24317907.320000004},{"$f":"'C2C'!E198","v":0},{"$f":"'C2C'!F198","v":951702.38000000012},{"$f":"'C2C'!G198","v":951702.38000000012},{"$f":"'C2C'!H198","v":2026492.2766666668},-1074789.8966666667,-0.53036959925382265,{"$f":"'C2C'!K198","v":24317907.320000004}]
["Road transport",null,{"$f":"'C2C'!C209","v":29867821.25},{"$f":"'C2C'!D209","v":42001221.479999997},{"$f":"'C2C'!E209","v":0},{"$f":"'C2C'!F209","v":2363092.86},{"$f":"'C2C'!G209","v":2363092.86},{"$f":"'C2C'!H209","v":3500101.79},-1137008.9300000002,-0.32485024671239637,{"$f":"'C2C'!K209","v":42001221.479999997}]
["Environmental protection",null,{"$f":"'C2C'!C214","v":0},{"$f":"'C2C'!D214","v":0},{"$f":"'C2C'!E214","v":0},{"$f":"'C2C'!F214","v":0},{"$f":"'C2C'!G214","v":0},{"$f":"'C2C'!H214","v":0},0,"",{"$f":"'C2C'!K214","v":0}]
["Trading services",null,{"$f":"SUM(C44:C47)","v":53729019.369999997},{"$f":"SUM(D44:D47)","v":48123559.120000005},0,1316159.73,1316159.73,4010296.5933333337,-2694136.8633333337,-0.67180489039439939,{"$f":"SUM(K44:K47)","v":48123559.120000005}]
["Energy sources",null,{"$f":"'C2C'!C222","v":42237695.420000002},{"$f":"'C2C'!D222","v":35287529.57},{"$f":"'C2C'!E222","v":0},{"$f":"'C2C'!F222","v":414856.3},{"$f":"'C2C'!G222","v":414856.3},{"$f":"'C2C'!H222","v":2940627.4641666668},-2525771.164166667,-0.85892252417034254,{"$f":"'C2C'!K222","v":35287529.57}]
["Water management",null,{"$f":"'C2C'!C226","v":17143.109999999997},{"$f":"'C2C'!D226","v":0},{"$f":"'C2C'!E226","v":0},{"$f":"'C2C'!F226","v":0},{"$f":"'C2C'!G226","v":0},{"$f":"'C2C'!H226","v":0},0,"",{"$f":"'C2C'!K226","v":0}]
["Waste water management",null,{"$f":"'C2C'!C230","v":9441.1200000000008},{"$f":"'C2C'!D230","v":0},{"$f":"'C2C'!E230","v":0},{"$f":"'C2C'!F230","v":0},{"$f":"'C2C'!G230","v":0},{"$f":"'C2C'!H230","v":0},0,"",{"$f":"'C2C'!K230","v":0}]
["Waste management",null,{"$f":"'C2C'!C235","v":11464739.720000001},{"$f":"'C2C'!D235","v":12836029.550000001},{"$f":"'C2C'!E235","v":0},{"$f":"'C2C'!F235","v":901303.43},{"$f":"'C2C'!G235","v":901303.43},{"$f":"'C2C'!H235","v":1069669.1291666667},-168365.6991666666,-0.15739979267966075,{"$f":"'C2C'!K235","v":12836029.550000001}]
["Other",null,{"$f":"'C2C'!C240","v":0},{"$f":"'C2C'!D240","v":0},{"$f":"'C2C'!E240","v":0},{"$f":"'C2C'!F240","v":0},{"$f":"'C2C'!G240","v":0},{"$f":"'C2C'!H240","v":0},0,"",{"$f":"'C2C'!K240","v":0}]
["Total Expenditure - Functional",3,{"$f":"C29+C33+C39+C43+C48","v":391038953.97000003},{"$f":"D29+D33+D39+D43+D48","v":372190739.43999994},0,14653498.549999999,14653498.549999999,31015894.953333329,-16362396.403333331,-0.52754874324768875,{"$f":"K29+K33+K39+K43+K48","v":372190739.43999994}]
["Surplus/ (Deficit) for the year",null,{"$f":"C26-C49","v":28315178.23999995},64870260.560000062,0,-6131670.959999999,-6131670.959999999,5405855.0466666706,{"$f":"I26-I49","v":-11537526.006666666},{"$f":"IF(I50=0,\"\",I50/H50)","v":-2.1342647753348238},{"$f":"K26-K49","v":64870260.560000062}]
[{"$f":"head27a","v":"References"}]
["1. Government Finance Statistics Functions and Sub-functions are standardised to assist the compilation of national and international accounts for comparison purposes"]
["2. Total Revenue by functional classification must reconcile to Total Operating Revenue shown in the Financial Performance Statement"]
["3. Total Expenditure by functional classification must reconcile to total operating expenditure shown in 'Financial Performance Statement'"]
["4. All amounts must be classified under a functional classification (modified GFS). The GFS function 'Other' is only for Abbatoirs, Air Transport, Licensing and Regulation, Markets and Tourism - and if used must be supported by footnotes. Nothing else may be placed under 'Other'. Assign associate share to relevant classification"]

{"sheet":"C2C","index":8,"n_rows":257,"n_cols":11,"rows_kept":257,"cut":false,"hidden":false,"merged":[[252,0,252,10],[0,0,0,10],[1,0,2,0],[1,1,2,1]]}
[{"$f":"muni& \" - \"&S71A& \" - \"&date","v":"LIM331 Greater Giyani - Table C2 Monthly Budget Statement - Financial Performance (functional classification) - M01 July"}]
[{"$f":"desc","v":"Description"},{"$f":"head27","v":"Ref"},{"$f":"Head1","v":"2018/19"},{"$f":"Head2","v":"Budget Year 2019/20"}]
[null,null,{"$f":"Head5","v":"Audited Outcome"},{"$f":"Head6","v":"Original Budget"},{"$f":"Head7","v":"Adjusted Budget"},{"$f":"Head38","v":"Monthly actual"},{"$f":"Head39","v":"YearTD actual"},{"$f":"Head40","v":"YearTD budget"},{"$f":"Head41","v":"YTD variance"},{"$f":"Head41","v":"YTD variance"},{"$f":"Head8","v":"Full Year Forecast"}]
["R thousands",1,null,null,null,null,null,null,null,"%"]
["Revenue - Functional"]
["Municipal governance and administration",null,{"$f":"C7+C10+C24","v":392363641.32999998},413436000,0,6156884.3900000006,6156884.3900000006,34453000,{"$f":"G6-H6","v":-28296115.609999999},{"$f":"IF(I6=0,\"\",I6/H6)","v":-0.82129613125126988},{"$f":"K7+K10+K24","v":413436000}]
["Executive and council",null,{"$f":"SUM(C8:C9)","v":0},{"$f":"SUM(D8:D9)","v":0},0,0,0,0,{"$f":"G7-H7","v":0},{"$f":"IF(I7=0,\"\",I7/H7)","v":""},0]
["Mayor and Council",null,0,0,0,0,0,0,0,"",0]
["Municipal Manager, Town Secretary and Chief Executive",null,0,0,0,0,0,0,0,"",0]
["Finance and administration",null,{"$f":"SUM(C11:C23)","v":392363641.32999998},413436000,0,6156884.3900000006,6156884.3900000006,34453000,{"$f":"G10-H10","v":-28296115.609999999},{"$f":"IF(I10=0,\"\",I10/H10)","v":-0.82129613125126988},{"$f":"SUM(K11:K23)","v":413436000}]
["Administrative and Corporate Support",null,0,0,0,0,0,0,0,"",0]
["Asset Management",null,0,0,0,0,0,0,0,"",0]
["Finance",null,393655563.00999999,412418000,0,6154377.4900000002,6154377.4900000002,{"$f":"D13*1/12","v":34368166.666666664},-28213789.176666662,-0.82092796657759837,412418000]
["Fleet Management",null,11666.15,18000,0,2045.2,2045.2,{"$f":"D14*1/12","v":1500},545.20000000000005,0.36346666666666672,18000]
["Human Resources",null,-1853224.39,300000,0,0,0,25000,-25000,-1,300000]
["Information Technology",null,0,0,0,0,0,0,{"$f":"G16-H16","v":0},{"$f":"IF(I16=0,\"\",I16/H16)","v":""},0]
["Legal Services",null,0,0,0,0,0,0,0,"",0]
["Marketing, Customer Relations, Publicity and Media Co-ordination",null,0,0,0,0,0,0,0,"",0]
["Property Services",null,0,0,0,0,0,0,0,"",0]
["Risk Management",null,0,0,0,0,0,0,0,"",0]
["Security Services",null,0,0,0,0,0,0,0,"",0]
["Supply Chain Management ",null,549636.56000000006,700000,0,461.7,461.7,{"$f":"D22*1/12","v":58333.333333333336},-57871.633333333339,-0.99208514285714289,700000]
["Valuation Service",null,0,0,0,0,0,0,0,"",0]
["Internal audit",null,{"$f":"SUM(C25:C25)","v":0},0,0,0,0,0,0,"",{"$f":"SUM(K25:K25)","v":0}]
["Governance Function",null,0,0,0,0,0,0,0,"",0]
["Community and public safety",null,{"$f":"C27+C49+C55+C64+C67","v":1252111.6099999999},{"$f":"D27+D49+D55+D64+D67","v":1543000},0,103195.84,103195.84,128583.33333333334,-25387.493333333347,-0.19744000000000009,1543000]
["Community and social services",null,{"$f":"SUM(C28:C48)","v":449493.35000000003},623000,0,37474.53,37474.53,51916.666666666672,-14442.136666666673,-0.27817919743178177,{"$f":"SUM(K28:K48)","v":623000}]
["Aged Care",null,0,0,0,0,0,0,{"$f":"G28-H28","v":0},{"$f":"IF(I28=0,\"\",I28/H28)","v":""},0]
["Agricultural",null,0,0,0,0,0,0,0,"",0]
["Animal Care and Diseases",null,0,0,0,0,0,0,0,"",0]
["Cemeteries, Funeral Parlours and Crematoriums",null,292381.31,320000,0,23071.949999999997,23071.949999999997,{"$f":"D31*1/12","v":26666.666666666668},-3594.7166666666708,-0.13480187500000015,320000]
["Child Care Facilities",null,0,0,0,0,0,0,0,"",0]
["Community Halls and Facilities",null,153734.09,300000,0,14240.85,14240.85,{"$f":"D33*1/12","v":25000},-10759.15,-0.43036599999999997,300000]
["Consumer Protection",null,0,0,0,0,0,0,0,"",0]
["Cultural Matters",null,0,0,0,0,0,0,{"$f":"G35-H35","v":0},{"$f":"IF(I35=0,\"\",I35/H35)","v":""},0]
["Disaster Management",null,0,0,0,0,0,0,0,"",0]
["Education",null,0,0,0,0,0,0,0,"",0]
["Indigenous and Customary Law",null,0,0,0,0,0,0,0,"",0]
["Industrial Promotion",null,0,0,0,0,0,0,0,"",0]
["Language Policy",null,0,0,0,0,0,0,0,"",0]
["Libraries and Archives",null,3377.95,3000,0,161.72999999999999,161.72999999999999,{"$f":"D41*1/12","v":250},-88.27000000000001,-0.35308000000000006,3000]
["Literacy Programmes",null,0,0,0,0,0,0,0,"",0]
["Media Services",null,0,0,0,0,0,0,0,"",0]
["Museums and Art Galleries",null,0,0,0,0,0,0,0,"",0]
["Population Development",null,0,0,0,0,0,0,0,"",0]
["Provincial Cultural Matters",null,0,0,0,0,0,0,0,"",0]
["Theatres",null,0,0,0,0,0,0,0,"",0]
["Zoo's",null,0,0,0,0,0,0,0,"",0]
["Sport and recreation",null,{"$f":"SUM(C50:C54)","v":194131.39},{"$f":"SUM(D50:D54)","v":220000},0,3271.31,3271.31,18333.333333333332,{"$f":"G49-H49","v":-15062.023333333333},{"$f":"IF(I49=0,\"\",I49/H49)","v":-0.82156490909090907},220000]
["Beaches and Jetties ",null,0,0,0,0,0,0,0,"",0]
["Casinos, Racing, Gambling, Wagering",null,0,0,0,0,0,0,0,"",0]
["Community Parks (including Nurseries)",null,0,0,0,0,0,0,0,"",0]
["Recreational Facilities",null,0,0,0,0,0,0,0,"",0]
["Sports Grounds and Stadiums",null,194131.39,220000,0,3271.31,3271.31,{"$f":"D54*1/12","v":18333.333333333332},-15062.023333333333,-0.82156490909090907,220000]
["Public safety",null,{"$f":"SUM(C56:C63)","v":0},{"$f":"SUM(D56:D63)","v":0},0,0,0,0,0,"",0]
["Civil Defence",null,0,0,0,0,0,0,0,"",0]
["Cleansing",null,0,0,0,0,0,0,0,"",0]
["Control of Public Nuisances",null,0,0,0,0,0,0,{"$f":"G58-H58","v":0},{"$f":"IF(I58=0,\"\",I58/H58)","v":""},0]
["Fencing and Fences ",null,0,0,0,0,0,0,0,"",0]
["Fire Fighting and Protection",null,0,0,0,0,0,0,0,"",0]
["Licensing and Control of Animals",null,0,0,0,0,0,0,{"$f":"G61-H61","v":0},{"$f":"IF(I61=0,\"\",I61/H61)","v":""},0]
["Police Forces, Traffic and Street Parking Control",null,0,0,0,0,0,0,{"$f":"G62-H62","v":0},{"$f":"IF(I62=0,\"\",I62/H62)","v":""},0]
["Pounds",null,0,0,0,0,0,0,0,"",0]
["Housing",null,{"$f":"SUM(C65:C66)","v":608486.87},700000,0,62450,62450,58333.333333333336,{"$f":"G64-H64","v":4116.6666666666642},{"$f":"IF(I64=0,\"\",I64/H64)","v":7.0571428571428521E-2},{"$f":"SUM(K65:K66)","v":700000}]
["Housing",null,608486.87,700000,0,62450,62450,{"$f":"D65*1/12","v":58333.333333333336},{"$f":"G65-H65","v":4116.6666666666642},{"$f":"IF(I65=0,\"\",I65/H65)","v":7.0571428571428521E-2},700000]
["Informal Settlements",null,0,0,0,0,0,0,{"$f":"G66-H66","v":0},{"$f":"IF(I66=0,\"\",I66/H66)","v":""},0]
["Health",null,{"$f":"SUM(C68:C74)","v":0},0,0,0,0,0,0,"",{"$f":"SUM(K68:K74)","v":0}]
["Ambulance",null,0,0,0,0,0,0,0,"",0]
["Health Services",null,0,0,0,0,0,0,0,"",0]
["Laboratory Services",null,0,0,0,0,0,0,{"$f":"G70-H70","v":0},{"$f":"IF(I70=0,\"\",I70/H70)","v":""},0]
["Food Control",null,0,0,0,0,0,0,{"$f":"G71-H71","v":0},{"$f":"IF(I71=0,\"\",I71/H71)","v":""},0]
["Health Surveillance and Prevention of Communicable Diseases including immunizations",null,0,0,0,0,0,0,0,"",0]
["Vector Control",null,0,0,0,0,0,0,0,"",0]
["Chemical Safety",null,0,0,0,0,0,0,0,"",0]
["Economic and environmental services",null,{"$f":"C76+C87+C92","v":21182454.32},16632000,0,1848615.66,1848615.66,1386000,462615.65999999992,0.33377753246753239,{"$f":"K76+K87+K92","v":16632000}]
["Planning and development",null,{"$f":"SUM(C77:C86)","v":822661.72},1132000,0,74454.89,74454.89,94333.333333333328,-19878.443333333329,-0.21072554770318017,{"$f":"SUM(K77:K86)","v":1132000}]
["Billboards",null,0,0,0,0,0,0,{"$f":"G77-H77","v":0},{"$f":"IF(I77=0,\"\",I77/H77)","v":""},0]
["Corporate Wide Strategic Planning (IDPs, LEDs)",null,131880.05000000002,132000,0,30000.73,30000.73,{"$f":"D78*1/12","v":11000},19000.73,1.7273390909090909,132000]
["Central City Improvement District",null,0,0,0,0,0,0,0,"",0]
["Development Facilitation",null,0,0,0,0,0,0,{"$f":"G80-H80","v":0},{"$f":"IF(I80=0,\"\",I80/H80)","v":""},0]
["Economic Development/Planning",null,0,0,0,0,0,0,{"$f":"G81-H81","v":0},{"$f":"IF(I81=0,\"\",I81/H81)","v":""},0]
["Regional Planning and Development",null,0,0,0,0,0,0,{"$f":"G82-H82","v":0},{"$f":"IF(I82=0,\"\",I82/H82)","v":""},0]
["Town Planning, Building Regulations and Enforcement, and City Engineer",null,690781.66999999993,1000000,0,44454.159999999996,44454.159999999996,{"$f":"D83*1/12","v":83333.333333333328},{"$f":"G83-H83","v":-38879.173333333332},{"$f":"IF(I83=0,\"\",I83/H83)","v":-0.46655008000000003},1000000]
["Project Management Unit",null,0,0,0,0,0,0,0,"",0]
["Provincial Planning",null,0,0,0,0,0,0,0,"",0]
["Support to Local Municipalities",null,0,0,0,0,0,0,0,"",0]
["Road transport",null,{"$f":"SUM(C88:C91)","v":20359792.600000001},15500000,0,1774160.77,1774160.77,1291666.6666666667,482494.10333333327,0.3735438219354838,{"$f":"SUM(K88:K91)","v":15500000}]
["Public Transport",null,0,0,0,0,0,0,0,"",0]
["Road and Traffic Regulation",null,20359792.600000001,15000000,0,1774160.77,1774160.77,{"$f":"D89*1/12","v":1250000},524160.77,0.41932861599999999,15000000]
["Roads",null,0,0,0,0,0,0,0,"",0]
["Taxi Ranks",null,0,500000,0,0,0,{"$f":"D91*1/12","v":41666.666666666664},-41666.666666666664,-1,500000]
["Environmental protection",null,{"$f":"SUM(C93:C98)","v":0},{"$f":"SUM(D93:D98)","v":0},0,0,0,0,0,"",0]
["Biodiversity and Landscape",null,0,0,0,0,0,0,0,"",0]
["Coastal Protection",null,0,0,0,0,0,0,0,"",0]
["Indigenous Forests",null,0,0,0,0,0,0,{"$f":"G95-H95","v":0},{"$f":"IF(I95=0,\"\",I95/H95)","v":""},0]
["Nature Conservation",null,0,0,0,0,0,0,{"$f":"G96-H96","v":0},{"$f":"IF(I96=0,\"\",I96/H96)","v":""},0]
["Pollution Control",null,0,0,0,0,0,0,0,"",0]
["Soil Conservation",null,0,0,0,0,0,0,0,"",0]
["Trading services",null,{"$f":"C100+C104+C108+C113","v":4555924.95},{"$f":"D100+D104+D108+D113","v":5450000},0,413131.69999999995,413131.69999999995,454166.66666666669,-41034.966666666733,-9.0352220183486376E-2,{"$f":"K100+K104+K108+K113","v":5450000}]
["Energy sources",null,{"$f":"SUM(C101:C103)","v":0},{"$f":"SUM(D101:D103)","v":0},0,0,0,0,0,"",0]
["Electricity ",null,0,0,0,0,0,0,0,"",0]
["Street Lighting and Signal Systems",null,0,0,0,0,0,0,{"$f":"G102-H102","v":0},{"$f":"IF(I102=0,\"\",I102/H102)","v":""},0]
["Nonelectric Energy",null,0,0,0,0,0,0,0,"",0]
["Water management",null,{"$f":"SUM(C105:C107)","v":0},{"$f":"SUM(D105:D107)","v":0},0,0,0,0,0,"",0]
["Water Treatment",null,0,0,0,0,0,0,0,"",0]
["Water Distribution",null,0,0,0,0,0,0,{"$f":"G106-H106","v":0},{"$f":"IF(I106=0,\"\",I106/H106)","v":""},0]
["Water Storage",null,0,0,0,0,0,0,0,"",0]
["Waste water management",null,{"$f":"SUM(C109:C112)","v":0},{"$f":"SUM(D109:D112)","v":0},0,0,0,0,0,"",0]
["Public Toilets",null,0,0,0,0,0,0,0,"",0]
["Sewerage",null,0,0,0,0,0,0,0,"",0]
["Storm Water Management",null,0,0,0,0,0,0,{"$f":"G111-H111","v":0},{"$f":"IF(I111=0,\"\",I111/H111)","v":""},0]
["Waste Water Treatment",null,0,0,0,0,0,0,0,"",0]
["Waste management",null,{"$f":"SUM(C114:C117)","v":4555924.95},5450000,0,413131.69999999995,413131.69999999995,454166.66666666669,-41034.966666666733,-9.0352220183486376E-2,{"$f":"SUM(K114:K117)","v":5450000}]
["Recycling",null,0,0,0,0,0,0,{"$f":"G114-H114","v":0},{"$f":"IF(I114=0,\"\",I114/H114)","v":""},0]
["Solid Waste Disposal (Landfill Sites)",null,0,0,0,0,0,0,{"$f":"G115-H115","v":0},{"$f":"IF(I115=0,\"\",I115/H115)","v":""},0]
["Solid Waste Removal",null,4555924.95,5450000,0,413131.69999999995,413131.69999999995,{"$f":"D116*1/12","v":454166.66666666669},-41034.966666666733,-9.0352220183486376E-2,5450000]
["Street Cleaning",null,0,0,0,0,0,0,{"$f":"G117-H117","v":0},{"$f":"IF(I117=0,\"\",I117/H117)","v":""},0]
["Other",null,{"$f":"SUM(C119:C124)","v":0},{"$f":"SUM(D119:D124)","v":0},0,0,0,0,0,"",0]
["Abattoirs",null,0,0,0,0,0,0,0,"",0]
["Air Transport",null,0,0,0,0,0,0,0,"",0]
["Forestry ",null,0,0,0,0,0,0,{"$f":"G121-H121","v":0},{"$f":"IF(I121=0,\"\",I121/H121)","v":""},0]
["Licensing and Regulation",null,0,0,0,0,0,0,0,"",0]
["Markets",null,0,0,0,0,0,0,0,"",0]
["Tourism",null,0,0,0,0,0,0,{"$f":"G124-H124","v":0},{"$f":"IF(I124=0,\"\",I124/H124)","v":""},0]
[{"$f":"\"Total \"&A5","v":"Total Revenue - Functional"},2,{"$f":"C6+C26+C75+C99+C118","v":419354132.20999998},437061000,0,8521827.5899999999,8521827.5899999999,36421750,{"$f":"G125-H125","v":-27899922.41},{"$f":"IF(I125=0,\"\",I125/H125)","v":-0.76602366470584193},{"$f":"K6+K26+K75+K99+K118","v":437061000}]
[]
["Expenditure - Functional"]
[{"$f":"A6","v":"Municipal governance and administration"},null,{"$f":"C129+C132+C146","v":273267441.13000005},238034505.92999992,0,8871899.879999999,8871899.879999999,19836208.827499997,{"$f":"G128-H128","v":-10964308.947499998},{"$f":"IF(I128=0,\"\",I128/H128)","v":-0.55274216171285662},{"$f":"K129+K132+K146","v":238034505.92999992}]
["Executive and council",null,{"$f":"SUM(C130:C131)","v":35336748.979999997},36481597.609999992,0,2430642.2799999998,2430642.2799999998,3040133.1341666658,-609490.85416666605,-0.20048163263538596,36481597.609999992]
["Mayor and Council",null,33838909.07,34973780.639999993,0,2319508.3899999997,2319508.3899999997,{"$f":"D130*1/12","v":2914481.7199999993},-594973.32999999961,-0.2041437851255419,34973780.639999993]
["Municipal Manager, Town Secretary and Chief Executive",null,1497839.91,1507816.97,0,111133.88999999998,111133.88999999998,{"$f":"D131*1/12","v":125651.41416666667},-14517.524166666684,-0.11553808815402854,1507816.97]
["Finance and administration",null,{"$f":"SUM(C133:C145)","v":235495037.85000005},198964333.27999994,0,6249109.0800000001,6249109.0800000001,16580361.106666666,-10331252.026666665,-0.62310175032995241,{"$f":"SUM(K133:K145)","v":198964333.27999994}]
["Administrative and Corporate Support",null,13331320.41,15710749.229999999,0,922867.36,922867.36,{"$f":"D133*1/12","v":1309229.1024999998},-386361.74249999982,-0.29510628946624706,15710749.229999999]
["Asset Management",null,98573923.530000031,42562573.529999994,0,452643.25999999995,452643.25999999995,{"$f":"D134*1/12","v":3546881.1274999995},-3094237.8674999997,-0.87238273747306472,42562573.529999994]
["Finance",null,54139930.099999994,47504687.790000007,0,919292.94000000006,919292.94000000006,3958723.9825000004,-3039431.0425000004,-0.76778049086932021,47504687.790000007]
["Fleet Management",null,9349424.6200000029,9785666.1599999983,0,643638.05999999994,643638.05999999994,815472.17999999982,-171834.11999999988,-0.21071732943728372,9785666.1599999983]
["Human Resources",null,13327829.330000006,17059043.099999998,0,640877.60000000009,640877.60000000009,1421586.9249999998,-780709.32499999972,-0.54918155989652184,17059043.099999998]
["Information Technology",null,5456619.7599999979,11259999.150000002,0,190224.07,190224.07,938333.26250000019,-748109.19250000012,-0.79727451045145059,11259999.150000002]
["Legal Services",null,9625587.8399999961,6222259.4699999988,0,76053.05,76053.05,518521.62249999988,-442468.57249999989,-0.85332713873470145,6222259.4699999988]
["Marketing, Customer Relations, Publicity and Media Co-ordination",null,0,0,0,0,0,0,0,"",0]
["Property Services",null,9335430.3000000007,14810122.670000002,0,626678.74,626678.74,{"$f":"D141*1/12","v":1234176.8891666669},-607498.1491666669,-0.49222939960969286,14810122.670000002]
["Risk Management",null,8141563.9699999997,12372126.279999999,0,730122.32999999984,730122.32999999984,{"$f":"D142*1/12","v":1031010.5233333333},-300888.19333333347,-0.29183813988681673,12372126.279999999]
["Security Services",null,12130580.279999997,16022267.480000002,0,941714.75000000012,941714.75000000012,1335188.9566666668,-393474.20666666667,-0.29469552208474298,16022267.480000002]
["Supply Chain Management ",null,2082827.7100000002,5654838.419999999,0,104996.92,104996.92,471236.53499999992,-366239.61499999993,-0.77718849834085979,5654838.419999999]
["Valuation Service",null,0,0,0,0,0,0,0,"",0]
["Internal audit",null,{"$f":"SUM(C147:C147)","v":2435654.2999999998},2588575.04,0,192148.52,192148.52,215714.58666666667,-23566.06666666668,-0.1092465142521038,{"$f":"SUM(K147:K147)","v":2588575.04}]
["Governance Function",null,2435654.2999999998,2588575.04,0,192148.52,192148.52,{"$f":"D147*1/12","v":215714.58666666667},-23566.06666666668,-0.1092465142521038,2588575.04]
["Community and public safety",null,{"$f":"C149+C171+C177+C186+C189","v":16096280.900000002},19713545.590000004,0,1150643.7,1150643.7,1642795.4658333333,-492151.76583333337,-0.29958188713631601,{"$f":"K149+K171+K177+K186+K189","v":19713545.590000004}]
["Community and social services",null,{"$f":"SUM(C150:C170)","v":8963636.6100000013},11309842.530000001,0,628193.79,628193.79,942486.87750000006,-314293.08750000002,-0.33347210980133779,{"$f":"SUM(K150:K170)","v":11309842.530000001}]
["Aged Care",null,0,0,0,0,0,0,0,"",0]
["Agricultural",null,0,0,0,0,0,0,0,"",0]
["Animal Care and Diseases",null,584735.89,745614.3899999999,0,56174.850000000006,56174.850000000006,{"$f":"D152*1/12","v":62134.532499999994},-5959.6824999999881,-9.5915785638203507E-2,745614.3899999999]
["Cemeteries, Funeral Parlours and Crematoriums",null,2822821.8800000004,3194757.8899999997,0,165848.75999999998,165848.75999999998,{"$f":"D153*1/12","v":266229.82416666666},-100381.06416666668,-0.37704665313464497,3194757.8899999997]
["Child Care Facilities",null,0,0,0,0,0,0,0,"",0]
["Community Halls and Facilities",null,4523608.7299999995,5016026.3400000008,0,322020.50000000006,322020.50000000006,418002.19500000007,-95981.695000000007,-0.22962007412425189,5016026.3400000008]
["Consumer Protection",null,0,0,0,0,0,0,0,"",0]
["Cultural Matters",null,0,0,0,0,0,0,{"$f":"G157-H157","v":0},{"$f":"IF(I157=0,\"\",I157/H157)","v":""},0]
["Disaster Management",null,643691.71000000008,1719129.3699999999,0,51146.57,51146.57,{"$f":"D158*1/12","v":143260.78083333332},{"$f":"G158-H158","v":-92114.210833333316},{"$f":"IF(I158=0,\"\",I158/H158)","v":-0.64298275004166783},1719129.3699999999]
["Education",null,0,0,0,0,0,0,{"$f":"G159-H159","v":0},{"$f":"IF(I159=0,\"\",I159/H159)","v":""},0]
[{"$f":"A38","v":"Indigenous and Customary Law"},null,0,0,0,0,0,0,0,"",0]
["Industrial Promotion",null,0,0,0,0,0,0,0,"",0]
["Language Policy",null,0,0,0,0,0,0,0,"",0]
["Libraries and Archives",null,388778.40000000008,634314.54,0,33003.11,33003.11,{"$f":"D163*1/12","v":52859.545000000006},-19856.435000000005,-0.37564521223177388,634314.54]
["Literacy Programmes",null,0,0,0,0,0,0,0,"",0]
["Media Services",null,0,0,0,0,0,0,0,"",0]
["Museums and Art Galleries",null,0,0,0,0,0,0,0,"",0]
["Population Development",null,0,0,0,0,0,0,0,"",0]
["Provincial Cultural Matters",null,0,0,0,0,0,0,0,"",0]
["Theatres",null,0,0,0,0,0,0,0,"",0]
["Zoo's",null,0,0,0,0,0,0,0,"",0]
["Sport and recreation",null,{"$f":"SUM(C172:C176)","v":5871099.1800000006},7025909.8900000006,0,427817.93999999994,427817.93999999994,585492.49083333334,{"$f":"G171-H171","v":-157674.5508333334},{"$f":"IF(I171=0,\"\",I171/H171)","v":-0.26930243052120906},7025909.8900000006]
["Beaches and Jetties ",null,0,0,0,0,0,0,0,"",0]
["Casinos, Racing, Gambling, Wagering",null,0,0,0,0,0,0,0,"",0]
["Community Parks (including Nurseries)",null,0,0,0,0,0,0,0,"",0]
["Recreational Facilities",null,378526.17,510000,0,29799.599999999999,29799.599999999999,{"$f":"D175*1/12","v":42500},-12700.400000000001,-0.29883294117647063,510000]
["Sports Grounds and Stadiums",null,5492573.0100000007,6515909.8900000006,0,398018.33999999997,398018.33999999997,{"$f":"D176*1/12","v":542992.49083333334},-144974.15083333338,-0.26699107866269167,6515909.8900000006]
["Public safety",null,{"$f":"SUM(C178:C185)","v":135175},100000,0,0,0,8333.3333333333339,-8333.3333333333339,-1,100000]
["Civil Defence",null,0,0,0,0,0,0,0,"",0]
["Cleansing",null,45900,0,0,0,0,0,0,"",0]
["Control of Public Nuisances",null,0,0,0,0,0,0,{"$f":"G180-H180","v":0},{"$f":"IF(I180=0,\"\",I180/H180)","v":""},0]
["Fencing and Fences ",null,89275,100000,0,0,0,{"$f":"D181*1/12","v":8333.3333333333339},-8333.3333333333339,-1,100000]
["Fire Fighting and Protection",null,0,0,0,0,0,0,0,"",0]
["Licensing and Control of Animals",null,0,0,0,0,0,0,{"$f":"G183-H183","v":0},{"$f":"IF(I183=0,\"\",I183/H183)","v":""},0]
["Police Forces, Traffic and Street Parking Control",null,0,0,0,0,0,0,{"$f":"G184-H184","v":0},{"$f":"IF(I184=0,\"\",I184/H184)","v":""},0]
["Pounds",null,0,0,0,0,0,0,0,"",0]
["Housing",null,{"$f":"SUM(C187:C188)","v":1126370.1100000001},1277793.17,0,94631.97,94631.97,106482.76416666666,{"$f":"G186-H186","v":-11850.794166666659},{"$f":"IF(I186=0,\"\",I186/H186)","v":-0.11129307413655992},{"$f":"SUM(K187:K188)","v":1277793.17}]
["Housing",null,1126370.1100000001,1277793.17,0,94631.97,94631.97,{"$f":"D187*1/12","v":106482.76416666666},{"$f":"G187-H187","v":-11850.794166666659},{"$f":"IF(I187=0,\"\",I187/H187)","v":-0.11129307413655992},1277793.17]
["Informal Settlements",null,0,0,0,0,0,0,{"$f":"G188-H188","v":0},{"$f":"IF(I188=0,\"\",I188/H188)","v":""},0]
["Health",null,{"$f":"SUM(C190:C196)","v":0},0,0,0,0,0,0,"",0]
["Ambulance",null,0,0,0,0,0,0,0,"",0]
["Health Services",null,0,0,0,0,0,0,0,"",0]
[{"$f":"A70","v":"Laboratory Services"},null,0,0,0,0,0,0,0,"",0]
["Food Control",null,0,0,0,0,0,0,{"$f":"G193-H193","v":0},{"$f":"IF(I193=0,\"\",I193/H193)","v":""},0]
["Health Surveillance and Prevention of Communicable Diseases including immunizations",null,0,0,0,0,0,0,{"$f":"G194-H194","v":0},{"$f":"IF(I194=0,\"\",I194/H194)","v":""},0]
["Vector Control",null,0,0,0,0,0,0,0,"",0]
["Chemical Safety",null,0,0,0,0,0,0,0,"",0]
["Economic and environmental services",null,{"$f":"C198+C209+C214","v":47946212.57},66319128.799999997,0,3314795.24,3314795.24,5526594.0666666664,-2211798.8266666662,-0.40021011132462275,{"$f":"K198+K209+K214","v":66319128.799999997}]
["Planning and development",null,{"$f":"SUM(C199:C208)","v":18078391.32},24317907.320000004,0,951702.38000000012,951702.38000000012,2026492.2766666668,-1074789.8966666667,-0.53036959925382265,24317907.320000004]
["Billboards",null,0,0,0,0,0,0,0,"",0]
["Corporate Wide Strategic Planning (IDPs, LEDs)",null,5229310.7100000009,6953160.8400000017,0,402320.27,402320.27,{"$f":"D200*1/12","v":579430.07000000018},-177109.80000000016,-0.30566207929112155,6953160.8400000017]
["Central City Improvement District",null,0,0,0,0,0,0,0,"",0]
["Development Facilitation",null,0,0,0,0,0,0,{"$f":"G202-H202","v":0},{"$f":"IF(I202=0,\"\",I202/H202)","v":""},0]
["Economic Development/Planning",null,116990.56,1260000,0,0,0,{"$f":"D203*1/12","v":105000},{"$f":"G203-H203","v":-105000},{"$f":"IF(I203=0,\"\",I203/H203)","v":-1},1260000]
["Regional Planning and Development",null,0,0,0,0,0,0,{"$f":"G204-H204","v":0},{"$f":"IF(I204=0,\"\",I204/H204)","v":""},0]
["Town Planning, Building Regulations and Enforcement, and City Engineer",null,9324888.6699999999,12556977.469999999,0,237207.57000000004,237207.57000000004,{"$f":"D205*1/12","v":1046414.7891666666},{"$f":"G205-H205","v":-809207.2191666665},{"$f":"IF(I205=0,\"\",I205/H205)","v":-0.77331401232497388},12556977.469999999]
["Project Management Unit",null,3407201.38,3547769.0100000002,0,312174.54000000004,312174.54000000004,{"$f":"D206*1/12","v":295647.41750000004},{"$f":"G206-H206","v":16527.122499999998},{"$f":"IF(I206=0,\"\",I206/H206)","v":5.5901460732360346E-2},3547769.0100000002]
["Provincial Planning",null,0,0,0,0,0,0,0,"",0]
["Support to Local Municipalities",null,0,0,0,0,0,0,0,"",0]
["Road transport",null,{"$f":"SUM(C210:C213)","v":29867821.25},42001221.479999997,0,2363092.86,2363092.86,3500101.79,-1137008.9300000002,-0.32485024671239637,{"$f":"SUM(K210:K213)","v":42001221.479999997}]
["Public Transport",null,716297.13000000012,1508503.79,0,62169.97,62169.97,{"$f":"D210*1/12","v":125708.64916666667},-63538.679166666669,-0.50544397372710614,1508503.79]
["Road and Traffic Regulation",null,14387976.549999999,16903663.129999995,0,1386634.7000000002,1386634.7000000002,{"$f":"D211*1/12","v":1408638.5941666663},{"$f":"G211-H211","v":-22003.894166666083},{"$f":"IF(I211=0,\"\",I211/H211)","v":-1.5620681030455028E-2},16903663.129999995]
["Roads",null,14763547.57,23589054.560000002,0,914288.18999999983,914288.18999999983,1965754.5466666669,-1051466.3566666669,-0.53489198763377666,23589054.560000002]
["Taxi Ranks",null,0,0,0,0,0,0,0,"",0]
["Environmental protection",null,{"$f":"SUM(C215:C220)","v":0},0,0,0,0,0,0,"",0]
["Biodiversity and Landscape",null,0,0,0,0,0,0,0,"",0]
["Coastal Protection",null,0,0,0,0,0,0,0,"",0]
["Indigenous Forests",null,0,0,0,0,0,0,0,"",0]
["Nature Conservation",null,0,0,0,0,0,0,{"$f":"G218-H218","v":0},{"$f":"IF(I218=0,\"\",I218/H218)","v":""},0]
["Pollution Control",null,0,0,0,0,0,0,{"$f":"G219-H219","v":0},{"$f":"IF(I219=0,\"\",I219/H219)","v":""},0]
["Soil Conservation",null,0,0,0,0,0,0,0,"",0]
["Trading services",null,{"$f":"C222+C226+C230+C235","v":53729019.369999997},{"$f":"D222+D226+D230+D235","v":48123559.120000005},0,1316159.73,1316159.73,4010296.5933333337,-2694136.8633333337,-0.67180489039439939,{"$f":"K222+K226+K230+K235","v":48123559.120000005}]
["Energy sources",null,{"$f":"SUM(C223:C225)","v":42237695.420000002},35287529.57,0,414856.3,414856.3,2940627.4641666668,-2525771.164166667,-0.85892252417034254,35287529.57]
["Electricity ",null,42237695.420000002,35287529.57,0,414856.3,414856.3,{"$f":"D223*1/12","v":2940627.4641666668},-2525771.164166667,-0.85892252417034254,35287529.57]
[{"$f":"A102","v":"Street Lighting and Signal Systems"},null,0,0,0,0,0,0,{"$f":"G224-H224","v":0},{"$f":"IF(I224=0,\"\",I224/H224)","v":""},0]
["Nonelectric Energy",null,0,0,0,0,0,0,0,"",0]
["Water management",null,{"$f":"SUM(C227:C229)","v":17143.109999999997},0,0,0,0,0,0,"",0]
["Water Treatment",null,0,0,0,0,0,0,0,"",0]
["Water Distribution",null,17143.109999999997,0,0,0,0,0,{"$f":"G228-H228","v":0},{"$f":"IF(I228=0,\"\",I228/H228)","v":""},0]
["Water Storage",null,0,0,0,0,0,0,0,"",0]
["Waste water management",null,{"$f":"SUM(C231:C234)","v":9441.1200000000008},0,0,0,0,0,0,"",0]
["Public Toilets",null,0,0,0,0,0,0,0,"",0]
["Sewerage",null,9441.1200000000008,0,0,0,0,0,0,"",0]
["Storm Water Management",null,0,0,0,0,0,0,{"$f":"G233-H233","v":0},{"$f":"IF(I233=0,\"\",I233/H233)","v":""},0]
["Waste Water Treatment",null,0,0,0,0,0,0,0,"",0]
["Waste management",null,{"$f":"SUM(C236:C239)","v":11464739.720000001},12836029.550000001,0,901303.43,901303.43,1069669.1291666667,-168365.6991666666,-0.15739979267966075,{"$f":"SUM(K236:K239)","v":12836029.550000001}]
["Recycling",null,0,0,0,0,0,0,{"$f":"G236-H236","v":0},{"$f":"IF(I236=0,\"\",I236/H236)","v":""},0]
["Solid Waste Disposal (Landfill Sites)",null,0,0,0,0,0,0,{"$f":"G237-H237","v":0},{"$f":"IF(I237=0,\"\",I237/H237)","v":""},0]
["Solid Waste Removal",null,11464739.720000001,12836029.550000001,0,901303.43,901303.43,{"$f":"D238*1/12","v":1069669.1291666667},{"$f":"G238-H238","v":-168365.6991666666},{"$f":"IF(I238=0,\"\",I238/H238)","v":-0.15739979267966075},12836029.550000001]
["Street Cleaning",null,0,0,0,0,0,0,0,"",0]
["Other",null,{"$f":"SUM(C241:C246)","v":0},0,0,0,0,0,0,"",0]
["Abattoirs",null,0,0,0,0,0,0,0,"",0]
["Air Transport",null,0,0,0,0,0,0,0,"",0]
["Forestry ",null,0,0,0,0,0,0,{"$f":"G243-H243","v":0},{"$f":"IF(I243=0,\"\",I243/H243)","v":""},0]
["Licensing and Regulation",null,0,0,0,0,0,0,0,"",0]
["Markets",null,0,0,0,0,0,0,{"$f":"G245-H245","v":0},{"$f":"IF(I245=0,\"\",I245/H245)","v":""},0]
["Tourism",null,0,0,0,0,0,0,{"$f":"G246-H246","v":0},{"$f":"IF(I246=0,\"\",I246/H246)","v":""},0]
[{"$f":"\"Total \"&A127","v":"Total Expenditure - Functional"},3,{"$f":"C128+C148+C197+C221+C240","v":391038953.97000003},372190739.43999994,0,14653498.549999999,14653498.549999999,31015894.953333329,-16362396.403333331,{"$f":"IF(I247=0,\"\",I247/H247)","v":-0.52754874324768875},{"$f":"K128+K148+K197+K221+K240","v":372190739.43999994}]
[{"$f":"result","v":"Surplus/ (Deficit) for the year"},null,{"$f":"C125-C247","v":28315178.23999995},64870260.560000062,0,-6131670.959999999,-6131670.959999999,5405855.0466666706,{"$f":"G248-H248","v":-11537526.00666667},{"$f":"IF(I248=0,\"\",I248/H248)","v":-2.1342647753348247},{"$f":"K125-K247","v":64870260.560000062}]
[{"$f":"head27a","v":"References"}]
["1. Government Finance Statistics Functions and Sub-functions are standardised to assist national and international accounts and comparison"]
["2. Total Revenue by Functional Classification must reconcile to total operating revenue shown in Financial Performance (revenue and expenditure)"]
["3. Total Expenditure by Functional Classification must reconcile to total operating expenditure shown in Financial Performance (revenue and expenditure)"]
["4. All amounts must be classified under a Functional classification. The function 'Other' is only for Abbatoirs, Air Transport, Licensing and Regulation, Markets and Tourism - and if used must be supported by footnotes. Nothing else may be placed under 'Other'. Assign associate share to relevant classification"]
[]
[]
["check oprev balance",null,{"$f":"C125-'C4-FinPerf RE'!C53","v":0},{"$f":"D125-'C4-FinPerf RE'!D53","v":0},{"$f":"E125-'C4-FinPerf RE'!E53","v":0},{"$f":"F125-'C4-FinPerf RE'!F53","v":-147949000},{"$f":"G125-'C4-FinPerf RE'!G53","v":-147949000},{"$f":"H125-'C4-FinPerf RE'!H53","v":-90927999.666666672},{"$f":"I125-'C4-FinPerf RE'!I53","v":-27899922.41},null,{"$f":"K125-'C4-FinPerf RE'!K53","v":0}]
["check opexp balance",null,{"$f":"C247-'C4-FinPerf RE'!C36","v":0},{"$f":"D247-'C4-FinPerf RE'!D36","v":0},{"$f":"E247-'C4-FinPerf RE'!E36","v":0},{"$f":"F247-'C4-FinPerf RE'!F36","v":1.4901161193847656E-8},{"$f":"G247-'C4-FinPerf RE'!G36","v":1.4901161193847656E-8},{"$f":"H247-'C4-FinPerf RE'!H36","v":0},{"$f":"I247-'C4-FinPerf RE'!I36","v":2.2351741790771484E-8},null,{"$f":"K247-'C4-FinPerf RE'!K36","v":0}]

{"sheet":"C3-FinPerf V","index":9,"n_rows":43,"n_cols":11,"rows_kept":43,"cut":false,"hidden":false,"merged":[[0,0,0,10],[1,1,3,1],[1,3,1,10]]}
[{"$f":"muni& \" - \"&S71C& \" - \"&date","v":"LIM331 Greater Giyani - Table C3 Monthly Budget Statement - Financial Performance (revenue and expenditure by municipal vote) - M01 July"}]
[{"$f":"Vdesc","v":"Vote Description"},{"$f":"head27","v":"Ref"},{"$f":"Head1","v":"2018/19"},{"$f":"Head2","v":"Budget Year 2019/20"}]
[null,null,{"$f":"Head5","v":"Audited Outcome"},{"$f":"Head6","v":"Original Budget"},{"$f":"Head7","v":"Adjusted Budget"},{"$f":"Head38","v":"Monthly actual"},{"$f":"Head39","v":"YearTD actual"},{"$f":"Head40","v":"YearTD budget"},{"$f":"Head41","v":"YTD variance"},{"$f":"Head41","v":"YTD variance"},{"$f":"Head8","v":"Full Year Forecast"}]
["R thousands",null,null,null,null,null,null,null,null,"%"]
["Revenue by Vote",1]
[{"$f":"'Org structure'!A2","v":"Vote 1 - Energy Sources"},null,{"$f":"'C3C'!C6","v":0},{"$f":"'C3C'!D6","v":0},{"$f":"'C3C'!E6","v":0},{"$f":"'C3C'!F6","v":0},{"$f":"'C3C'!G6","v":0},{"$f":"'C3C'!H6","v":0},{"$f":"G6-H6","v":0},{"$f":"IF(I6=0,\"\",I6/H6)","v":""},{"$f":"'C3C'!K6","v":0}]
[{"$f":"'Org structure'!A3","v":"Vote 2 - Community and Social Services"},null,{"$f":"'C3C'!C17","v":449493.35},{"$f":"'C3C'!D17","v":623000},{"$f":"'C3C'!E17","v":0},{"$f":"'C3C'!F17","v":37474.53},{"$f":"'C3C'!G17","v":37474.53},{"$f":"'C3C'!H17","v":51916.666666666664},{"$f":"G7-H7","v":-14442.136666666665},{"$f":"IF(I7=0,\"\",I7/H7)","v":-0.27817919743178171},{"$f":"'C3C'!K17","v":623000}]
[{"$f":"'Org structure'!A4","v":"Vote 3 - Finance & Administration"},null,{"$f":"'C3C'!C28","v":392363641.32999998},{"$f":"'C3C'!D28","v":413436000},{"$f":"'C3C'!E28","v":0},{"$f":"'C3C'!F28","v":6156884.3900000006},{"$f":"'C3C'!G28","v":6156884.3900000006},{"$f":"'C3C'!H28","v":34453000},-28296115.609999999,-0.82129613125126988,{"$f":"'C3C'!K28","v":413436000}]
[{"$f":"'Org structure'!A5","v":"Vote 4 - Planning and Development"},null,{"$f":"'C3C'!C39","v":822661.72},{"$f":"'C3C'!D39","v":1132000},{"$f":"'C3C'!E39","v":0},{"$f":"'C3C'!F39","v":74454.89},{"$f":"'C3C'!G39","v":74454.89},{"$f":"'C3C'!H39","v":94333.333333333328},-19878.443333333329,-0.21072554770318017,{"$f":"'C3C'!K39","v":1132000}]
[{"$f":"'Org structure'!A6","v":"Vote 5 - Executive & Council"},null,{"$f":"'C3C'!C50","v":0},{"$f":"'C3C'!D50","v":0},{"$f":"'C3C'!E50","v":0},{"$f":"'C3C'!F50","v":0},{"$f":"'C3C'!G50","v":0},{"$f":"'C3C'!H50","v":0},0,"",{"$f":"'C3C'!K50","v":0}]
[{"$f":"'Org structure'!A7","v":"Vote 6 - Internal Audit"},null,{"$f":"'C3C'!C61","v":0},{"$f":"'C3C'!D61","v":0},{"$f":"'C3C'!E61","v":0},{"$f":"'C3C'!F61","v":0},{"$f":"'C3C'!G61","v":0},{"$f":"'C3C'!H61","v":0},0,"",{"$f":"'C3C'!K61","v":0}]
[{"$f":"'Org structure'!A8","v":"Vote 7 - Road Transport"},null,{"$f":"'C3C'!C72","v":20359792.600000001},{"$f":"'C3C'!D72","v":15500000},{"$f":"'C3C'!E72","v":0},{"$f":"'C3C'!F72","v":1774160.77},{"$f":"'C3C'!G72","v":1774160.77},{"$f":"'C3C'!H72","v":1291666.6666666667},482494.10333333327,0.3735438219354838,{"$f":"'C3C'!K72","v":15500000}]
[{"$f":"'Org structure'!A9","v":"Vote 8 - Public Safety"},null,{"$f":"'C3C'!C83","v":0},{"$f":"'C3C'!D83","v":0},{"$f":"'C3C'!E83","v":0},{"$f":"'C3C'!F83","v":0},{"$f":"'C3C'!G83","v":0},{"$f":"'C3C'!H83","v":0},0,"",{"$f":"'C3C'!K83","v":0}]
[{"$f":"'Org structure'!A10","v":"Vote 9 - Waste Management"},null,{"$f":"'C3C'!C94","v":4555924.95},{"$f":"'C3C'!D94","v":5450000},{"$f":"'C3C'!E94","v":0},{"$f":"'C3C'!F94","v":413131.69999999995},{"$f":"'C3C'!G94","v":413131.69999999995},{"$f":"'C3C'!H94","v":454166.66666666663},-41034.966666666674,-9.0352220183486265E-2,{"$f":"'C3C'!K94","v":5450000}]
[{"$f":"'Org structure'!A11","v":"Vote 10 - Sports & Recreation"},null,{"$f":"'C3C'!C105","v":194131.39},{"$f":"'C3C'!D105","v":220000},{"$f":"'C3C'!E105","v":0},{"$f":"'C3C'!F105","v":3271.31},{"$f":"'C3C'!G105","v":3271.31},{"$f":"'C3C'!H105","v":18333.333333333332},-15062.023333333333,-0.82156490909090907,{"$f":"'C3C'!K105","v":220000}]
[{"$f":"'Org structure'!A12","v":"Vote 11 - Water Management"},null,{"$f":"'C3C'!C116","v":0},{"$f":"'C3C'!D116","v":0},{"$f":"'C3C'!E116","v":0},{"$f":"'C3C'!F116","v":0},{"$f":"'C3C'!G116","v":0},{"$f":"'C3C'!H116","v":0},0,"",{"$f":"'C3C'!K116","v":0}]
[{"$f":"'Org structure'!A13","v":"Vote 12 - Waste Water Management"},null,{"$f":"'C3C'!C127","v":0},{"$f":"'C3C'!D127","v":0},{"$f":"'C3C'!E127","v":0},{"$f":"'C3C'!F127","v":0},{"$f":"'C3C'!G127","v":0},{"$f":"'C3C'!H127","v":0},0,"",{"$f":"'C3C'!K127","v":0}]
[{"$f":"'Org structure'!A14","v":"Vote 13 - Housing"},null,{"$f":"'C3C'!C138","v":608486.87},{"$f":"'C3C'!D138","v":700000},{"$f":"'C3C'!E138","v":0},{"$f":"'C3C'!F138","v":62450},{"$f":"'C3C'!G138","v":62450},{"$f":"'C3C'!H138","v":58333.333333333328},4116.6666666666715,7.057142857142866E-2,{"$f":"'C3C'!K138","v":700000}]
[{"$f":"'Org structure'!A15","v":"Vote 14 - Finance & Administration"},null,{"$f":"'C3C'!C149","v":0},{"$f":"'C3C'!D149","v":0},{"$f":"'C3C'!E149","v":0},{"$f":"'C3C'!F149","v":0},{"$f":"'C3C'!G149","v":0},{"$f":"'C3C'!H149","v":0},0,"",{"$f":"'C3C'!K149","v":0}]
[{"$f":"'Org structure'!A16","v":"Vote 15 - [NAME OF VOTE 5]"},null,{"$f":"'C3C'!C160","v":0},{"$f":"'C3C'!D160","v":0},{"$f":"'C3C'!E160","v":0},{"$f":"'C3C'!F160","v":0},{"$f":"'C3C'!G160","v":0},{"$f":"'C3C'!H160","v":0},0,"",{"$f":"'C3C'!K160","v":0}]
["Total Revenue by Vote",2,{"$f":"SUM(C6:C20)","v":419354132.21000004},{"$f":"SUM(D6:D20)","v":437061000},0,8521827.5899999999,8521827.5899999999,36421750,-27899922.409999996,-0.76602366470584193,{"$f":"SUM(K6:K20)","v":437061000}]
[]
["Expenditure by Vote",1]
[{"$f":"'Org structure'!A2","v":"Vote 1 - Energy Sources"},null,{"$f":"'C3C'!C174","v":42237695.420000002},{"$f":"'C3C'!D174","v":35287529.57},{"$f":"'C3C'!E174","v":0},{"$f":"'C3C'!F174","v":414856.3},{"$f":"'C3C'!G174","v":414856.3},{"$f":"'C3C'!H174","v":2940627.4641666664},{"$f":"G24-H24","v":-2525771.1641666666},{"$f":"IF(I24=0,\"\",I24/H24)","v":-0.85892252417034254},{"$f":"'C3C'!K174","v":35287529.57}]
[{"$f":"'Org structure'!A3","v":"Vote 2 - Community and Social Services"},null,{"$f":"'C3C'!C185","v":8963636.6100000013},{"$f":"'C3C'!D185","v":11309842.529999999},{"$f":"'C3C'!E185","v":0},{"$f":"'C3C'!F185","v":628193.79},{"$f":"'C3C'!G185","v":628193.79},{"$f":"'C3C'!H185","v":942486.87749999994},-314293.08749999991,-0.33347210980133773,{"$f":"'C3C'!K185","v":11309842.529999999}]
[{"$f":"'Org structure'!A4","v":"Vote 3 - Finance & Administration"},null,{"$f":"'C3C'!C196","v":204576517.40000007},{"$f":"'C3C'!D196","v":155971317.41999996},{"$f":"'C3C'!E196","v":0},{"$f":"'C3C'!F196","v":4194302.9000000004},{"$f":"'C3C'!G196","v":4194302.9000000004},{"$f":"'C3C'!H196","v":12997609.785},-8803306.8849999998,-0.67730198325845492,{"$f":"'C3C'!K196","v":155971317.41999996}]
[{"$f":"'Org structure'!A5","v":"Vote 4 - Planning and Development"},null,{"$f":"'C3C'!C207","v":18078391.32},{"$f":"'C3C'!D207","v":24317907.320000004},{"$f":"'C3C'!E207","v":0},{"$f":"'C3C'!F207","v":951702.38000000012},{"$f":"'C3C'!G207","v":951702.38000000012},{"$f":"'C3C'!H207","v":2026492.2766666666},-1074789.8966666665,-0.53036959925382254,{"$f":"'C3C'!K207","v":24317907.320000004}]
[{"$f":"'Org structure'!A6","v":"Vote 5 - Executive & Council"},null,{"$f":"'C3C'!C218","v":35336748.979999997},{"$f":"'C3C'!D218","v":36481597.609999992},{"$f":"'C3C'!E218","v":0},{"$f":"'C3C'!F218","v":2430642.2799999998},{"$f":"'C3C'!G218","v":2430642.2799999998},{"$f":"'C3C'!H218","v":3040133.1341666658},-609490.85416666605,-0.20048163263538596,{"$f":"'C3C'!K218","v":36481597.609999992}]
[{"$f":"'Org structure'!A7","v":"Vote 6 - Internal Audit"},null,{"$f":"'C3C'!C229","v":2435654.2999999998},{"$f":"'C3C'!D229","v":2588575.04},{"$f":"'C3C'!E229","v":0},{"$f":"'C3C'!F229","v":192148.52},{"$f":"'C3C'!G229","v":192148.52},{"$f":"'C3C'!H229","v":215714.58666666667},-23566.06666666668,-0.1092465142521038,{"$f":"'C3C'!K229","v":2588575.04}]
[{"$f":"'Org structure'!A8","v":"Vote 7 - Road Transport"},null,{"$f":"'C3C'!C240","v":29867821.25},{"$f":"'C3C'!D240","v":42001221.479999997},{"$f":"'C3C'!E240","v":0},{"$f":"'C3C'!F240","v":2363092.86},{"$f":"'C3C'!G240","v":2363092.86},{"$f":"'C3C'!H240","v":3500101.79},-1137008.9300000002,{"$f":"IF(I30=0,\"\",I30/H30)","v":-0.32485024671239637},{"$f":"'C3C'!K240","v":42001221.479999997}]
[{"$f":"'Org structure'!A9","v":"Vote 8 - Public Safety"},null,{"$f":"'C3C'!C251","v":135175},{"$f":"'C3C'!D251","v":100000},{"$f":"'C3C'!E251","v":0},{"$f":"'C3C'!F251","v":0},{"$f":"'C3C'!G251","v":0},{"$f":"'C3C'!H251","v":8333.3333333333321},-8333.3333333333321,-1,{"$f":"'C3C'!K251","v":100000}]
[{"$f":"'Org structure'!A10","v":"Vote 9 - Waste Management"},null,{"$f":"'C3C'!C262","v":11464739.720000001},{"$f":"'C3C'!D262","v":12836029.550000001},{"$f":"'C3C'!E262","v":0},{"$f":"'C3C'!F262","v":901303.43},{"$f":"'C3C'!G262","v":901303.43},{"$f":"'C3C'!H262","v":1069669.1291666667},-168365.6991666666,-0.15739979267966075,{"$f":"'C3C'!K262","v":12836029.550000001}]
[{"$f":"'Org structure'!A11","v":"Vote 10 - Sports & Recreation"},null,{"$f":"'C3C'!C273","v":5871099.1800000006},{"$f":"'C3C'!D273","v":7025909.8900000006},{"$f":"'C3C'!E273","v":0},{"$f":"'C3C'!F273","v":427817.93999999994},{"$f":"'C3C'!G273","v":427817.93999999994},{"$f":"'C3C'!H273","v":585492.49083333334},-157674.5508333334,{"$f":"IF(I33=0,\"\",I33/H33)","v":-0.26930243052120906},{"$f":"'C3C'!K273","v":7025909.8900000006}]
[{"$f":"'Org structure'!A12","v":"Vote 11 - Water Management"},null,{"$f":"'C3C'!C284","v":17143.109999999997},{"$f":"'C3C'!D284","v":0},{"$f":"'C3C'!E284","v":0},{"$f":"'C3C'!F284","v":0},{"$f":"'C3C'!G284","v":0},{"$f":"'C3C'!H284","v":0},0,{"$f":"IF(I34=0,\"\",I34/H34)","v":""},{"$f":"'C3C'!K284","v":0}]
[{"$f":"'Org structure'!A13","v":"Vote 12 - Waste Water Management"},null,{"$f":"'C3C'!C295","v":9441.1200000000008},{"$f":"'C3C'!D295","v":0},{"$f":"'C3C'!E295","v":0},{"$f":"'C3C'!F295","v":0},{"$f":"'C3C'!G295","v":0},{"$f":"'C3C'!H295","v":0},0,{"$f":"IF(I35=0,\"\",I35/H35)","v":""},{"$f":"'C3C'!K295","v":0}]
[{"$f":"'Org structure'!A14","v":"Vote 13 - Housing"},null,{"$f":"'C3C'!C306","v":1126370.1100000001},{"$f":"'C3C'!D306","v":1277793.17},{"$f":"'C3C'!E306","v":0},{"$f":"'C3C'!F306","v":94631.97},{"$f":"'C3C'!G306","v":94631.97},{"$f":"'C3C'!H306","v":106482.76416666666},-11850.794166666659,{"$f":"IF(I36=0,\"\",I36/H36)","v":-0.11129307413655992},{"$f":"'C3C'!K306","v":1277793.17}]
[{"$f":"'Org structure'!A15","v":"Vote 14 - Finance & Administration"},null,{"$f":"'C3C'!C317","v":30918520.449999996},{"$f":"'C3C'!D317","v":42993015.859999999},{"$f":"'C3C'!E317","v":0},{"$f":"'C3C'!F317","v":2054806.1800000002},{"$f":"'C3C'!G317","v":2054806.1800000002},{"$f":"'C3C'!H317","v":3582751.3216666668},-1527945.1416666666,{"$f":"IF(I37=0,\"\",I37/H37)","v":-0.4264725638160895},{"$f":"'C3C'!K317","v":42993015.859999999}]
[{"$f":"'Org structure'!A16","v":"Vote 15 - [NAME OF VOTE 5]"},null,{"$f":"'C3C'!C328","v":0},{"$f":"'C3C'!D328","v":0},{"$f":"'C3C'!E328","v":0},{"$f":"'C3C'!F328","v":0},{"$f":"'C3C'!G328","v":0},{"$f":"'C3C'!H328","v":0},0,"",{"$f":"'C3C'!K328","v":0}]
["Total Expenditure by Vote",2,{"$f":"SUM(C24:C38)","v":391038953.97000015},{"$f":"SUM(D24:D38)","v":372190739.43999994},0,14653498.549999999,14653498.549999999,31015894.953333329,-16362396.403333332,{"$f":"IF(I39=0,\"\",I39/H39)","v":-0.52754874324768886},{"$f":"SUM(K24:K38)","v":372190739.43999994}]
[{"$f":"result","v":"Surplus/ (Deficit) for the year"},2,{"$f":"C21-C39","v":28315178.23999989},64870260.560000062,0,-6131670.959999999,-6131670.959999999,5405855.0466666706,{"$f":"I21-I39","v":-11537526.006666664},{"$f":"IF(I40=0,\"\",I40/H40)","v":-2.1342647753348234},{"$f":"K21-K39","v":64870260.560000062}]
[{"$f":"head27a","v":"References"}]
["1. Insert 'Vote'; e.g. Department, if different to standard classification structure"]
["2. Must reconcile to Monthly Budget Statement - Financial Performance Statement (standard classification)"]

{"sheet":"C3C","index":10,"n_rows":348,"n_cols":24,"rows_kept":348,"cut":false,"hidden":false,"merged":[[1,11,1,22],[1,3,1,10]]}
[{"$f":"muni& \" - \"&S71C& \" - \"&\"A\"& \" - \"&date","v":"LIM331 Greater Giyani - Table C3 Monthly Budget Statement - Financial Performance (revenue and expenditure by municipal vote) - A - M01 July"}]
[{"$f":"Vdesc","v":"Vote Description"},{"$f":"head27","v":"Ref"},{"$f":"Head1","v":"2018/19"},{"$f":"Head2","v":"Budget Year 2019/20"},null,null,null,null,null,null,null,{"$f":"Head4","v":{"$error":"#REF!"}}]
["R thousand",null,{"$f":"Head5","v":"Audited Outcome"},{"$f":"Head6","v":"Original Budget"},{"$f":"Head7","v":"Adjusted Budget"},{"$f":"Head38","v":"Monthly actual"},{"$f":"Head39","v":"YearTD actual"},{"$f":"Head40","v":"YearTD budget"},{"$f":"Head41","v":"YTD variance"},{"$f":"Head41","v":"YTD variance"},{"$f":"Head8","v":"Full Year Forecast"},{"$f":"Head12","v":"Forecast 2010/11"},{"$f":"Head13","v":"Forecast 2011/12"},{"$f":"Head14","v":"Forecast 2012/13"},{"$f":"Head15","v":"Forecast 2013/14"},{"$f":"Head16","v":"Forecast 2014/15"},{"$f":"Head17","v":"Forecast 2015/16"},{"$f":"Head18","v":"Forecast 2016/17"},{"$f":"Head19","v":"Forecast 2017/18"},{"$f":"Head20","v":"Forecast 2018/19"},{"$f":"Head21","v":"Forecast 2019/20"},{"$f":"Head22","v":"Forecast 2020/21"},{"$f":"Head23","v":"Forecast 2021/22"}]
[null,null,null,null,null,null,null,null,null,"%"]
["Revenue by Vote",1]
[{"$f":"'Org structure'!A2","v":"Vote 1 - Energy Sources"},null,{"$f":"SUM(C7:C16)","v":0},{"$f":"SUM(D7:D16)","v":0},0,0,0,0,{"$f":"G6-H6","v":0},{"$f":"IF(I6=0,\"\",I6/H6)","v":""},0]
[{"$f":"'Org structure'!C3","v":"Electricity"},null,0,0,0,0,0,0,0,"",0]
[{"$f":"'Org structure'!C4","v":"Street Lighting and Signal Systems"},null,0,0,0,0,0,0,0,"",0]
[null,null,0,0,0,0,0,0,0,"",0]
[null,null,0,0,0,0,0,0,0,"",0]
[null,null,0,0,0,0,0,0,0,"",0]
[null,null,0,0,0,0,0,0,0,"",0]
[null,null,0,0,0,0,0,0,0,"",0]
[null,null,0,0,0,0,0,0,0,"",0]
[null,null,0,0,0,0,0,0,0,"",0]
[null,null,0,0,0,0,0,0,0,"",0]
[{"$f":"'Org structure'!A3","v":"Vote 2 - Community and Social Services"},null,{"$f":"SUM(C18:C27)","v":449493.35},{"$f":"SUM(D18:D27)","v":623000},0,37474.53,37474.53,51916.666666666664,-14442.136666666665,-0.27817919743178171,623000]
[{"$f":"'Org structure'!C14","v":"Animal Care and Diseases"},null,0,0,0,0,0,{"$f":"1/12*D18","v":0},0,"",0]
[{"$f":"'Org structure'!C15","v":"Community Halls and Facilities"},null,153734.09,300000,0,14240.85,14240.85,{"$f":"1/12*D19","v":25000},-10759.15,-0.43036599999999997,300000]
[{"$f":"'Org structure'!C16","v":"Libraries and Archives"},null,3377.95,3000,0,161.72999999999999,161.72999999999999,250,-88.27000000000001,-0.35308000000000006,3000]
[{"$f":"'Org structure'!C17","v":"Cemeteries, Funeral Parlours and Crematoriums"},null,292381.31,320000,0,23071.949999999997,23071.949999999997,26666.666666666664,-3594.7166666666672,-0.13480187500000004,320000]
[{"$f":"'Org structure'!C18","v":"Disaster Management"},null,0,0,0,0,0,0,0,"",0]
[null,null,0,0,0,0,0,0,0,"",0]
[null,null,0,0,0,0,0,0,0,"",0]
[null,null,0,0,0,0,0,0,0,"",0]
[null,null,0,0,0,0,0,0,0,"",0]
[null,null,0,0,0,0,0,0,0,"",0]
[{"$f":"'Org structure'!A4","v":"Vote 3 - Finance & Administration"},null,{"$f":"SUM(C29:C38)","v":392363641.32999998},413436000,0,6156884.3900000006,6156884.3900000006,34453000,-28296115.609999999,-0.82129613125126988,413436000]
[{"$f":"'Org structure'!C25","v":"Fleet Management"},null,11666.15,18000,0,2045.2,2045.2,{"$f":"1/12*D29","v":1500},545.20000000000005,0.36346666666666672,18000]
[{"$f":"'Org structure'!C26","v":"Finance"},null,393655563.00999999,412418000,0,6154377.4900000002,6154377.4900000002,34368166.666666664,-28213789.176666662,-0.82092796657759837,412418000]
[{"$f":"'Org structure'!C27","v":"Asset Management"},null,0,0,0,0,0,0,0,"",0]
[{"$f":"'Org structure'!C28","v":"Human Resources"},null,-1853224.39,300000,0,0,0,25000,-25000,-1,300000]
[{"$f":"'Org structure'!C29","v":"Legal Services"},null,0,0,0,0,0,0,0,{"$f":"IF(I33=0,\"\",I33/H33)","v":""},0]
[{"$f":"'Org structure'!C30","v":"Property Services"},null,0,0,0,0,0,0,0,"",0]
[{"$f":"'Org structure'!C31","v":"Risk Management"},null,0,0,0,0,0,0,0,"",0]
[{"$f":"'Org structure'!C32","v":"Supply Chain Management"},null,549636.56000000006,700000,0,461.7,461.7,58333.333333333328,-57871.633333333331,-0.99208514285714289,700000]
[null,null,0,0,0,0,0,0,0,"",0]
[null,null,0,0,0,0,0,0,0,"",0]
[{"$f":"'Org structure'!A5","v":"Vote 4 - Planning and Development"},null,{"$f":"SUM(C40:C49)","v":822661.72},1132000,0,74454.89,74454.89,94333.333333333328,-19878.443333333329,-0.21072554770318017,1132000]
[{"$f":"'Org structure'!C36","v":"Town Planning, Building Regulations and Enforcement, and City Engineer"},null,690781.66999999993,1000000,0,44454.159999999996,44454.159999999996,{"$f":"1/12*D40","v":83333.333333333328},-38879.173333333332,-0.46655008000000003,1000000]
[{"$f":"'Org structure'!C37","v":"Corporate Wide Strategic Planning (IDPs, LEDs)"},null,131880.05000000002,132000,0,30000.73,30000.73,11000,19000.73,1.7273390909090909,132000]
[{"$f":"'Org structure'!C38","v":"Economic Development/Planning"},null,0,0,0,0,0,0,0,"",0]
[{"$f":"'Org structure'!C39","v":"Project Management Unit"},null,0,0,0,0,0,0,0,"",0]
[null,null,0,0,0,0,0,0,0,"",0]
[null,null,0,0,0,0,0,0,0,"",0]
[null,null,0,0,0,0,0,0,0,"",0]
[null,null,0,0,0,0,0,0,0,"",0]
[null,null,0,0,0,0,0,0,0,"",0]
[null,null,0,0,0,0,0,0,0,"",0]
[{"$f":"'Org structure'!A6","v":"Vote 5 - Executive & Council"},null,{"$f":"SUM(C51:C60)","v":0},{"$f":"SUM(D51:D60)","v":0},0,0,0,0,0,"",0]
[{"$f":"'Org structure'!C47","v":"Municipal Manager, Town Secretary and Chief Executive"},null,0,0,0,0,0,0,0,"",0]
[{"$f":"'Org structure'!C48","v":"Mayor and Council"},null,0,0,0,0,0,0,0,"",0]
[null,null,0,0,0,0,0,0,0,"",0]
[null,null,0,0,0,0,0,0,0,"",0]
[null,null,0,0,0,0,0,0,0,"",0]
[null,null,0,0,0,0,0,0,0,"",0]
[null,null,0,0,0,0,0,0,0,"",0]
[null,null,0,0,0,0,0,0,0,"",0]
[null,null,0,0,0,0,0,0,0,"",0]
[null,null,0,0,0,0,0,0,0,"",0]
[{"$f":"'Org structure'!A7","v":"Vote 6 - Internal Audit"},null,{"$f":"SUM(C62:C71)","v":0},{"$f":"SUM(D62:D71)","v":0},0,0,0,0,0,"",0]
[{"$f":"'Org structure'!C58","v":"Governance Function"},null,0,0,0,0,0,0,0,"",0]
[null,null,0,0,0,0,0,0,0,"",0]
[null,null,0,0,0,0,0,0,0,"",0]
[null,null,0,0,0,0,0,0,0,"",0]
[null,null,0,0,0,0,0,0,0,"",0]
[null,null,0,0,0,0,0,0,0,"",0]
[null,null,0,0,0,0,0,0,0,"",0]
[null,null,0,0,0,0,0,0,0,"",0]
[null,null,0,0,0,0,0,0,{"$f":"G70-H70","v":0},{"$f":"IF(I70=0,\"\",I70/H70)","v":""},0]
[null,null,0,0,0,0,0,0,0,"",0]
[{"$f":"'Org structure'!A8","v":"Vote 7 - Road Transport"},null,{"$f":"SUM(C73:C82)","v":20359792.600000001},15500000,0,1774160.77,1774160.77,1291666.6666666667,482494.10333333327,0.3735438219354838,15500000]
[{"$f":"'Org structure'!C69","v":"Taxi Ranks"},null,0,500000,0,0,0,{"$f":"1/12*D73","v":41666.666666666664},-41666.666666666664,-1,500000]
[{"$f":"'Org structure'!C70","v":"Road and Traffic Regulation"},null,20359792.600000001,15000000,0,1774160.77,1774160.77,1250000,524160.77,0.41932861599999999,15000000]
[{"$f":"'Org structure'!C72","v":"Roads"},null,0,0,0,0,0,0,0,"",0]
[null,null,0,0,0,0,0,0,0,"",0]
[null,null,0,0,0,0,0,0,0,"",0]
[null,null,0,0,0,0,0,0,0,"",0]
[null,null,0,0,0,0,0,0,0,"",0]
[null,null,0,0,0,0,0,0,0,"",0]
[null,null,0,0,0,0,0,0,0,"",0]
[null,null,0,0,0,0,0,0,0,"",0]
[{"$f":"'Org structure'!A9","v":"Vote 8 - Public Safety"},null,{"$f":"SUM(C84:C93)","v":0},{"$f":"SUM(D84:D93)","v":0},0,0,0,0,0,"",0]
[{"$f":"'Org structure'!C80","v":"Cleansing"},null,0,0,0,0,0,0,0,"",0]
[{"$f":"'Org structure'!C81","v":"Fencing and Fences"},null,0,0,0,0,0,0,0,"",0]
[null,null,0,0,0,0,0,0,0,"",0]
[null,null,0,0,0,0,0,0,0,"",0]
[null,null,0,0,0,0,0,0,0,"",0]
[null,null,0,0,0,0,0,0,0,"",0]
[null,null,0,0,0,0,0,0,0,"",0]
[null,null,0,0,0,0,0,0,0,"",0]
[null,null,0,0,0,0,0,0,0,"",0]
[null,null,0,0,0,0,0,0,0,"",0]
[{"$f":"'Org structure'!A10","v":"Vote 9 - Waste Management"},null,{"$f":"SUM(C95:C104)","v":4555924.95},{"$f":"SUM(D95:D104)","v":5450000},0,413131.69999999995,413131.69999999995,454166.66666666663,-41034.966666666674,-9.0352220183486265E-2,5450000]
[{"$f":"'Org structure'!C91","v":"Recycling"},null,0,0,0,0,0,{"$f":"1/12*D95","v":0},0,"",0]
[{"$f":"'Org structure'!C92","v":"Solid Waste Disposal (Landfill Sites)"},null,0,0,0,0,0,0,0,"",0]
[{"$f":"'Org structure'!C93","v":"Solid Waste Removal"},null,4555924.95,5450000,0,413131.69999999995,413131.69999999995,454166.66666666663,-41034.966666666674,-9.0352220183486265E-2,5450000]
[null,null,0,0,0,0,0,0,0,"",0]
[null,null,0,0,0,0,0,0,0,"",0]
[null,null,0,0,0,0,0,0,0,"",0]
[null,null,0,0,0,0,0,0,0,"",0]
[null,null,0,0,0,0,0,0,0,"",0]
[null,null,0,0,0,0,0,0,0,"",0]
[null,null,0,0,0,0,0,0,0,"",0]
[{"$f":"'Org structure'!A11","v":"Vote 10 - Sports & Recreation"},null,{"$f":"SUM(C106:C115)","v":194131.39},{"$f":"SUM(D106:D115)","v":220000},0,3271.31,3271.31,18333.333333333332,-15062.023333333333,-0.82156490909090907,220000]
[{"$f":"'Org structure'!C102","v":"Recreational Facilities"},null,0,0,0,0,0,{"$f":"1/12*D106","v":0},0,"",0]
[{"$f":"'Org structure'!C103","v":"Sports Grounds and Stadiums"},null,194131.39,220000,0,3271.31,3271.31,18333.333333333332,-15062.023333333333,-0.82156490909090907,220000]
[null,null,0,0,0,0,0,0,0,"",0]
[null,null,0,0,0,0,0,0,0,"",0]
[null,null,0,0,0,0,0,0,0,"",0]
[null,null,0,0,0,0,0,0,0,"",0]
[null,null,0,0,0,0,0,0,0,"",0]
[null,null,0,0,0,0,0,0,0,"",0]
[null,null,0,0,0,0,0,0,0,"",0]
[null,null,0,0,0,0,0,0,0,"",0]
[{"$f":"'Org structure'!A12","v":"Vote 11 - Water Management"},null,{"$f":"SUM(C117:C126)","v":0},{"$f":"SUM(D117:D126)","v":0},0,0,0,0,0,"",0]
[{"$f":"'Org structure'!C113","v":"Water Distribution"},null,0,0,0,0,0,0,0,"",0]
[null,null,0,0,0,0,0,0,0,"",0]
[null,null,0,0,0,0,0,0,0,"",0]
[null,null,0,0,0,0,0,0,0,"",0]
[null,null,0,0,0,0,0,0,0,"",0]
[null,null,0,0,0,0,0,0,0,"",0]
[null,null,0,0,0,0,0,0,0,"",0]
[null,null,0,0,0,0,0,0,0,"",0]
[null,null,0,0,0,0,0,0,0,"",0]
[null,null,0,0,0,0,0,0,0,"",0]
[{"$f":"'Org structure'!A13","v":"Vote 12 - Waste Water Management"},null,{"$f":"SUM(C128:C137)","v":0},{"$f":"SUM(D128:D137)","v":0},0,0,0,0,0,"",0]
[{"$f":"'Org structure'!C124","v":"Sewerage"},null,0,0,0,0,0,0,0,"",0]
[null,null,0,0,0,0,0,0,0,"",0]
[null,null,0,0,0,0,0,0,0,"",0]
[null,null,0,0,0,0,0,0,0,"",0]
[null,null,0,0,0,0,0,0,0,"",0]
[null,null,0,0,0,0,0,0,0,"",0]
[null,null,0,0,0,0,0,0,{"$f":"G134-H134","v":0},{"$f":"IF(I134=0,\"\",I134/H134)","v":""},0]
[null,null,0,0,0,0,0,0,0,"",0]
[null,null,0,0,0,0,0,0,0,"",0]
[null,null,0,0,0,0,0,0,0,"",0]
[{"$f":"'Org structure'!A14","v":"Vote 13 - Housing"},null,{"$f":"SUM(C139:C148)","v":608486.87},{"$f":"SUM(D139:D148)","v":700000},0,62450,62450,58333.333333333328,4116.6666666666715,7.057142857142866E-2,700000]
[{"$f":"'Org structure'!C135","v":"Housing"},null,608486.87,700000,0,62450,62450,{"$f":"1/12*D139","v":58333.333333333328},4116.6666666666715,7.057142857142866E-2,700000]
[null,null,0,0,0,0,0,0,0,"",0]
[null,null,0,0,0,0,0,0,0,"",0]
[null,null,0,0,0,0,0,0,0,"",0]
[null,null,0,0,0,0,0,0,0,"",0]
[null,null,0,0,0,0,0,0,0,"",0]
[null,null,0,0,0,0,0,0,0,"",0]
[null,null,0,0,0,0,0,0,0,"",0]
[null,null,0,0,0,0,0,0,0,"",0]
[null,null,0,0,0,0,0,0,0,"",0]
[{"$f":"'Org structure'!A15","v":"Vote 14 - Finance & Administration"},null,{"$f":"SUM(C150:C159)","v":0},{"$f":"SUM(D150:D159)","v":0},0,0,0,0,0,"",0]
[{"$f":"'Org structure'!C146","v":"Security Services"},null,0,0,0,0,0,0,0,"",0]
[{"$f":"'Org structure'!C147","v":"Administrative and Corporate Support"},null,0,0,0,0,0,0,0,"",0]
[{"$f":"'Org structure'!C148","v":"Information Technology"},null,0,0,0,0,0,0,0,"",0]
[null,null,0,0,0,0,0,0,0,"",0]
[null,null,0,0,0,0,0,0,0,"",0]
[null,null,0,0,0,0,0,0,0,"",0]
[null,null,0,0,0,0,0,0,0,"",0]
[null,null,0,0,0,0,0,0,0,"",0]
[null,null,0,0,0,0,0,0,0,"",0]
[null,null,0,0,0,0,0,0,0,"",0]
[{"$f":"'Org structure'!A16","v":"Vote 15 - [NAME OF VOTE 5]"},null,{"$f":"SUM(C161:C170)","v":0},{"$f":"SUM(D161:D170)","v":0},0,0,0,0,0,"",0]
[null,null,0,0,0,0,0,0,0,"",0]
[null,null,0,0,0,0,0,0,0,"",0]
[null,null,0,0,0,0,0,0,0,"",0]
[null,null,0,0,0,0,0,0,0,"",0]
[null,null,0,0,0,0,0,0,0,"",0]
[null,null,0,0,0,0,0,0,0,"",0]
[null,null,0,0,0,0,0,0,0,"",0]
[null,null,0,0,0,0,0,0,0,"",0]
[null,null,0,0,0,0,0,0,0,"",0]
[null,null,0,0,0,0,0,0,0,"",0,{"$f":"SUM(L78:L81)","v":0},0,0,0,0,0,0,0,0,0,0,0]
["Total Revenue by Vote",2,{"$f":"C6+C17+C28+C39+C50+C61+C72+C83+C94+C105+C116+C127+C138+C149+C160","v":419354132.21000004},{"$f":"D6+D17+D28+D39+D50+D61+D72+D83+D94+D105+D116+D127+D138+D149+D160","v":437061000},0,8521827.5899999999,8521827.5899999999,36421750,-27899922.41,-0.76602366470584193,437061000]
[null,null,null,null,null,null,null,null,0,""]
["Expenditure by Vote",1,null,null,null,null,null,null,0,""]
[{"$f":"'Org structure'!A2","v":"Vote 1 - Energy Sources"},null,{"$f":"SUM(C175:C184)","v":42237695.420000002},35287529.57,0,414856.3,414856.3,2940627.4641666664,-2525771.1641666666,-0.85892252417034254,35287529.57]
[{"$f":"'Org structure'!C3","v":"Electricity"},null,42237695.420000002,35287529.57,0,414856.3,414856.3,{"$f":"1/12*D175","v":2940627.4641666664},-2525771.1641666666,-0.85892252417034254,35287529.57]
[{"$f":"'Org structure'!C4","v":"Street Lighting and Signal Systems"},null,0,0,0,0,0,0,0,"",0]
[null,null,0,0,0,0,0,0,0,"",0]
[null,null,0,0,0,0,0,0,0,"",0]
[null,null,0,0,0,0,0,0,0,"",0]
[null,null,0,0,0,0,0,0,0,"",0]
[null,null,0,0,0,0,0,0,0,"",0]
[null,null,0,0,0,0,0,0,0,"",0]
[null,null,0,0,0,0,0,0,0,"",0]
[null,null,0,0,0,0,0,0,0,"",0]
[{"$f":"'Org structure'!A3","v":"Vote 2 - Community and Social Services"},null,{"$f":"SUM(C186:C195)","v":8963636.6100000013},{"$f":"SUM(D186:D195)","v":11309842.529999999},{"$f":"SUM(E186:E195)","v":0},628193.79,628193.79,942486.87749999994,-314293.08749999991,-0.33347210980133773,11309842.529999999]
[{"$f":"'Org structure'!C14","v":"Animal Care and Diseases"},null,584735.89,745614.3899999999,0,56174.850000000006,56174.850000000006,{"$f":"1/12*D186","v":62134.532499999987},-5959.6824999999808,-9.5915785638203396E-2,745614.3899999999]
[{"$f":"'Org structure'!C15","v":"Community Halls and Facilities"},null,4523608.7299999995,5016026.3400000008,0,322020.50000000006,322020.50000000006,418002.19500000007,-95981.695000000007,-0.22962007412425189,5016026.3400000008]
[{"$f":"'Org structure'!C16","v":"Libraries and Archives"},null,388778.40000000008,634314.54,0,33003.11,33003.11,52859.544999999998,-19856.434999999998,-0.37564521223177383,634314.54]
[{"$f":"'Org structure'!C17","v":"Cemeteries, Funeral Parlours and Crematoriums"},null,2822821.8800000004,3194757.8899999997,0,165848.75999999998,165848.75999999998,266229.8241666666,-100381.06416666662,-0.3770466531346448,3194757.8899999997]
[{"$f":"'Org structure'!C18","v":"Disaster Management"},null,643691.71000000008,1719129.3699999999,0,51146.57,51146.57,143260.78083333332,-92114.210833333316,-0.64298275004166783,1719129.3699999999]
[null,null,0,0,0,0,0,0,0,"",0]
[null,null,0,0,0,0,0,0,0,"",0]
[null,null,0,0,0,0,0,0,0,"",0]
[null,null,0,0,0,0,0,0,0,"",0]
[null,null,0,0,0,0,0,0,0,"",0]
[{"$f":"'Org structure'!A4","v":"Vote 3 - Finance & Administration"},null,{"$f":"SUM(C197:C206)","v":204576517.40000007},155971317.41999996,0,4194302.9000000004,4194302.9000000004,12997609.785,-8803306.8849999998,-0.67730198325845492,155971317.41999996]
[{"$f":"'Org structure'!C25","v":"Fleet Management"},null,9349424.6200000029,9785666.1599999983,0,643638.05999999994,643638.05999999994,{"$f":"1/12*D197","v":815472.17999999982},-171834.11999999988,-0.21071732943728372,9785666.1599999983]
[{"$f":"'Org structure'!C26","v":"Finance"},null,54139930.099999994,47504687.790000007,0,919292.94000000006,919292.94000000006,3958723.9825000004,{"$f":"G198-H198","v":-3039431.0425000004},{"$f":"IF(I198=0,\"\",I198/H198)","v":-0.76778049086932021},47504687.790000007]
[{"$f":"'Org structure'!C27","v":"Asset Management"},null,98573923.530000031,42562573.529999994,0,452643.25999999995,452643.25999999995,3546881.1274999995,-3094237.8674999997,-0.87238273747306472,42562573.529999994]
[{"$f":"'Org structure'!C28","v":"Human Resources"},null,13327829.330000006,17059043.099999998,0,640877.60000000009,640877.60000000009,1421586.9249999998,-780709.32499999972,-0.54918155989652184,17059043.099999998]
[{"$f":"'Org structure'!C29","v":"Legal Services"},null,9625587.8399999961,6222259.4699999988,0,76053.05,76053.05,518521.62249999988,-442468.57249999989,-0.85332713873470145,6222259.4699999988]
[{"$f":"'Org structure'!C30","v":"Property Services"},null,9335430.3000000007,14810122.670000002,0,626678.74,626678.74,1234176.8891666667,-607498.14916666667,-0.49222939960969275,14810122.670000002]
[{"$f":"'Org structure'!C31","v":"Risk Management"},null,8141563.9699999997,12372126.279999999,0,730122.32999999984,730122.32999999984,1031010.5233333332,-300888.19333333336,-0.29183813988681667,12372126.279999999]
[{"$f":"'Org structure'!C32","v":"Supply Chain Management"},null,2082827.7100000002,5654838.419999999,0,104996.92,104996.92,471236.53499999992,-366239.61499999993,-0.77718849834085979,5654838.419999999]
[null,null,0,0,0,0,0,0,0,"",0]
[null,null,0,0,0,0,0,0,0,"",0]
[{"$f":"'Org structure'!A5","v":"Vote 4 - Planning and Development"},null,{"$f":"SUM(C208:C217)","v":18078391.32},24317907.320000004,0,951702.38000000012,951702.38000000012,2026492.2766666666,-1074789.8966666665,-0.53036959925382254,24317907.320000004]
[{"$f":"'Org structure'!C36","v":"Town Planning, Building Regulations and Enforcement, and City Engineer"},null,9324888.6699999999,12556977.469999999,0,237207.57000000004,237207.57000000004,{"$f":"1/12*D208","v":1046414.7891666666},-809207.2191666665,-0.77331401232497388,12556977.469999999]
[{"$f":"'Org structure'!C37","v":"Corporate Wide Strategic Planning (IDPs, LEDs)"},null,5229310.7100000009,6953160.8400000017,0,402320.27,402320.27,579430.07000000007,-177109.80000000005,-0.30566207929112138,6953160.8400000017]
[{"$f":"'Org structure'!C38","v":"Economic Development/Planning"},null,116990.56,1260000,0,0,0,105000,-105000,-1,1260000]
[{"$f":"'Org structure'!C39","v":"Project Management Unit"},null,3407201.38,3547769.0100000002,0,312174.54000000004,312174.54000000004,295647.41749999998,16527.122500000056,5.5901460732360554E-2,3547769.0100000002]
[null,null,0,0,0,0,0,0,0,"",0]
[null,null,0,0,0,0,0,0,0,"",0]
[null,null,0,0,0,0,0,0,0,"",0]
[null,null,0,0,0,0,0,0,0,"",0]
[null,null,0,0,0,0,0,0,0,"",0]
[null,null,0,0,0,0,0,0,0,"",0]
[{"$f":"'Org structure'!A6","v":"Vote 5 - Executive & Council"},null,{"$f":"SUM(C219:C228)","v":35336748.979999997},36481597.609999992,0,2430642.2799999998,2430642.2799999998,3040133.1341666658,-609490.85416666605,-0.20048163263538596,36481597.609999992]
[{"$f":"'Org structure'!C47","v":"Municipal Manager, Town Secretary and Chief Executive"},null,1497839.91,1507816.97,0,111133.88999999998,111133.88999999998,{"$f":"1/12*D219","v":125651.41416666665},-14517.52416666667,-0.11553808815402844,1507816.97]
[{"$f":"'Org structure'!C48","v":"Mayor and Council"},null,33838909.07,34973780.639999993,0,2319508.3899999997,2319508.3899999997,2914481.7199999993,-594973.32999999961,-0.2041437851255419,34973780.639999993]
[null,null,0,0,0,0,0,0,0,"",0]
[null,null,0,0,0,0,0,0,0,"",0]
[null,null,0,0,0,0,0,0,0,"",0]
[null,null,0,0,0,0,0,0,0,"",0]
[null,null,0,0,0,0,0,0,0,"",0]
[null,null,0,0,0,0,0,0,0,"",0]
[null,null,0,0,0,0,0,0,0,"",0]
[null,null,0,0,0,0,0,0,0,"",0]
[{"$f":"'Org structure'!A7","v":"Vote 6 - Internal Audit"},null,{"$f":"SUM(C230:C239)","v":2435654.2999999998},2588575.04,0,192148.52,192148.52,215714.58666666667,-23566.06666666668,-0.1092465142521038,2588575.04]
[{"$f":"'Org structure'!C58","v":"Governance Function"},null,2435654.2999999998,2588575.04,0,192148.52,192148.52,{"$f":"1/12*D230","v":215714.58666666667},-23566.06666666668,-0.1092465142521038,2588575.04]
[null,null,0,0,0,0,0,0,0,"",0]
[null,null,0,0,0,0,0,0,0,"",0]
[null,null,0,0,0,0,0,0,0,"",0]
[null,null,0,0,0,0,0,0,0,"",0]
[null,null,0,0,0,0,0,0,0,"",0]
[null,null,0,0,0,0,0,0,0,"",0]
[null,null,0,0,0,0,0,0,0,"",0]
[null,null,0,0,0,0,0,0,0,"",0]
[null,null,0,0,0,0,0,0,0,"",0]
[{"$f":"'Org structure'!A8","v":"Vote 7 - Road Transport"},null,{"$f":"SUM(C241:C250)","v":29867821.25},42001221.479999997,0,2363092.86,2363092.86,3500101.79,-1137008.9300000002,-0.32485024671239637,42001221.479999997]
[{"$f":"'Org structure'!C69","v":"Taxi Ranks"},null,0,0,0,0,0,{"$f":"1/12*D241","v":0},0,"",0]
[{"$f":"'Org structure'!C70","v":"Road and Traffic Regulation"},null,14387976.549999999,16903663.129999995,0,1386634.7000000002,1386634.7000000002,1408638.5941666663,-22003.894166666083,-1.5620681030455028E-2,16903663.129999995]
[{"$f":"'Org structure'!C71","v":"Public Transport"},null,716297.13000000012,1508503.79,0,62169.97,62169.97,125708.64916666667,-63538.679166666669,-0.50544397372710614,1508503.79]
[{"$f":"'Org structure'!C72","v":"Roads"},null,14763547.57,23589054.560000002,0,914288.18999999983,914288.18999999983,1965754.5466666669,-1051466.3566666669,-0.53489198763377666,23589054.560000002]
[null,null,0,0,0,0,0,0,0,"",0]
[null,null,0,0,0,0,0,0,0,"",0]
[null,null,0,0,0,0,0,0,0,"",0]
[null,null,0,0,0,0,0,0,0,"",0]
[null,null,0,0,0,0,0,0,0,"",0]
[null,null,0,0,0,0,0,0,0,"",0]
[{"$f":"'Org structure'!A9","v":"Vote 8 - Public Safety"},null,{"$f":"SUM(C252:C261)","v":135175},100000,0,0,0,8333.3333333333321,-8333.3333333333321,-1,{"$f":"SUM(K252:K261)","v":100000}]
[{"$f":"'Org structure'!C80","v":"Cleansing"},null,45900,0,0,0,0,{"$f":"1/12*D252","v":0},0,"",0]
[{"$f":"'Org structure'!C81","v":"Fencing and Fences"},null,89275,100000,0,0,0,8333.3333333333321,-8333.3333333333321,-1,100000]
[null,null,0,0,0,0,0,0,0,"",0]
[null,null,0,0,0,0,0,0,0,"",0]
[null,null,0,0,0,0,0,0,0,"",0]
[null,null,0,0,0,0,0,0,0,"",0]
[null,null,0,0,0,0,0,0,0,"",0]
[null,null,0,0,0,0,0,0,0,"",0]
[null,null,0,0,0,0,0,0,0,"",0]
[null,null,0,0,0,0,0,0,0,"",0]
[{"$f":"'Org structure'!A10","v":"Vote 9 - Waste Management"},null,{"$f":"SUM(C263:C272)","v":11464739.720000001},12836029.550000001,0,901303.43,901303.43,1069669.1291666667,{"$f":"G262-H262","v":-168365.6991666666},{"$f":"IF(I262=0,\"\",I262/H262)","v":-0.15739979267966075},{"$f":"SUM(K263:K272)","v":12836029.550000001}]
[{"$f":"'Org structure'!C91","v":"Recycling"},null,0,0,0,0,0,{"$f":"1/12*D263","v":0},0,"",0]
[{"$f":"'Org structure'!C92","v":"Solid Waste Disposal (Landfill Sites)"},null,0,0,0,0,0,0,0,"",0]
[{"$f":"'Org structure'!C93","v":"Solid Waste Removal"},null,11464739.720000001,12836029.550000001,0,901303.43,901303.43,1069669.1291666667,-168365.6991666666,-0.15739979267966075,12836029.550000001]
[null,null,0,0,0,0,0,0,0,"",0]
[null,null,0,0,0,0,0,0,0,"",0]
[null,null,0,0,0,0,0,0,0,"",0]
[null,null,0,0,0,0,0,0,0,"",0]
[null,null,0,0,0,0,0,0,0,"",0]
[null,null,0,0,0,0,0,0,0,"",0]
[null,null,0,0,0,0,0,0,0,"",0]
[{"$f":"'Org structure'!A11","v":"Vote 10 - Sports & Recreation"},null,{"$f":"SUM(C274:C283)","v":5871099.1800000006},7025909.8900000006,0,427817.93999999994,427817.93999999994,585492.49083333334,-157674.55083333337,-0.56582401983916231,7025909.8900000006]
[{"$f":"'Org structure'!C102","v":"Recreational Facilities"},null,378526.17,510000,0,29799.599999999999,29799.599999999999,{"$f":"1/12*D274","v":42500},-12700.400000000001,-0.29883294117647063,510000]
[{"$f":"'Org structure'!C103","v":"Sports Grounds and Stadiums"},null,5492573.0100000007,6515909.8900000006,0,398018.33999999997,398018.33999999997,542992.49083333334,-144974.15083333338,-0.26699107866269167,6515909.8900000006]
[null,null,0,0,0,0,0,0,0,"",0]
[null,null,0,0,0,0,0,0,0,"",0]
[null,null,0,0,0,0,0,0,0,"",0]
[null,null,0,0,0,0,0,0,0,"",0]
[null,null,0,0,0,0,0,0,0,"",0]
[null,null,0,0,0,0,0,0,0,"",0]
[null,null,0,0,0,0,0,0,0,"",0]
[null,null,0,0,0,0,0,0,0,"",0]
[{"$f":"'Org structure'!A12","v":"Vote 11 - Water Management"},null,{"$f":"SUM(C285:C294)","v":17143.109999999997},0,0,0,0,0,0,"",0]
[{"$f":"'Org structure'!C113","v":"Water Distribution"},null,17143.109999999997,0,0,0,0,0,0,"",0]
[null,null,0,0,0,0,0,0,0,"",0]
[null,null,0,0,0,0,0,0,0,"",0]
[null,null,0,0,0,0,0,0,0,"",0]
[null,null,0,0,0,0,0,0,0,"",0]
[null,null,0,0,0,0,0,0,0,"",0]
[null,null,0,0,0,0,0,0,0,"",0]
[null,null,0,0,0,0,0,0,0,"",0]
[null,null,0,0,0,0,0,0,0,"",0]
[null,null,0,0,0,0,0,0,0,"",0]
[{"$f":"'Org structure'!A13","v":"Vote 12 - Waste Water Management"},null,{"$f":"SUM(C296:C305)","v":9441.1200000000008},0,0,0,0,0,0,"",0]
[{"$f":"'Org structure'!C124","v":"Sewerage"},null,9441.1200000000008,0,0,0,0,0,0,""]
[null,null,0,0,0,0,0,0,0,""]
[null,null,0,0,0,0,0,0,0,""]
[null,null,0,0,0,0,0,0,0,""]
[null,null,0,0,0,0,0,0,0,""]
[null,null,0,0,0,0,0,0,0,"",0]
[null,null,0,0,0,0,0,0,0,"",0]
[null,null,0,0,0,0,0,0,0,"",0]
[null,null,0,0,0,0,0,0,0,"",0]
[null,null,0,0,0,0,0,0,0,"",0]
[{"$f":"'Org structure'!A14","v":"Vote 13 - Housing"},null,{"$f":"SUM(C307:C316)","v":1126370.1100000001},1277793.17,0,94631.97,94631.97,106482.76416666666,-11850.794166666659,-0.11129307413655992,1277793.17,0,0,0,0,0,0,0,0,0,0,0,0]
[{"$f":"'Org structure'!C135","v":"Housing"},null,1126370.1100000001,1277793.17,0,94631.97,94631.97,{"$f":"1/12*D307","v":106482.76416666666},-11850.794166666659,-0.11129307413655992,1277793.17]
[null,null,0,0,0,0,0,0,0,"",0]
[null,null,0,0,0,0,0,0,0,"",0]
[null,null,0,0,0,0,0,0,0,"",0]
[null,null,0,0,0,0,0,0,0,"",0]
[null,null,0,0,0,0,0,0,0,"",0]
[null,null,0,0,0,0,0,0,0,"",0]
[null,null,0,0,0,0,0,0,0,"",0]
[null,null,0,0,0,0,0,0,0,"",0]
[null,null,0,0,0,0,0,0,0,"",0]
[{"$f":"'Org structure'!A15","v":"Vote 14 - Finance & Administration"},null,{"$f":"SUM(C318:C327)","v":30918520.449999996},42993015.859999999,0,2054806.1800000002,2054806.1800000002,3582751.3216666668,-1527945.1416666666,-1.3870763220024407,42993015.859999999]
[{"$f":"'Org structure'!C146","v":"Security Services"},null,12130580.279999997,16022267.480000002,0,941714.75000000012,941714.75000000012,{"$f":"1/12*D318","v":1335188.9566666668},-393474.20666666667,-0.29469552208474298,16022267.480000002]
[{"$f":"'Org structure'!C147","v":"Administrative and Corporate Support"},null,13331320.41,15710749.229999999,0,922867.36,922867.36,1309229.1024999998,-386361.74249999982,-0.29510628946624706,15710749.229999999]
[{"$f":"'Org structure'!C148","v":"Information Technology"},null,5456619.7599999979,11259999.150000002,0,190224.07,190224.07,938333.26250000019,-748109.19250000012,-0.79727451045145059,11259999.150000002]
[null,null,0,0,0,0,0,0,0,"",0]
[null,null,0,0,0,0,0,0,0,"",0]
[null,null,0,0,0,0,0,0,0,"",0]
[null,null,0,0,0,0,0,0,0,"",0]
[null,null,0,0,0,0,0,0,0,"",0]
[null,null,0,0,0,0,0,0,{"$f":"G326-H326","v":0},{"$f":"IF(I326=0,\"\",I326/H326)","v":""},0]
[null,null,0,0,0,0,0,0,0,"",0]
[{"$f":"'Org structure'!A16","v":"Vote 15 - [NAME OF VOTE 5]"},null,{"$f":"SUM(C329:C338)","v":0},0,0,0,0,0,0,"",0]
[null,null,0,0,0,0,0,0,0,"",0]
[null,null,0,0,0,0,0,0,0,""]
[null,null,0,0,0,0,0,0,0,""]
[null,null,0,0,0,0,0,0,0,""]
[null,null,0,0,0,0,0,0,0,""]
[null,null,0,0,0,0,0,0,0,""]
[null,null,0,0,0,0,0,0,0,""]
[null,null,0,0,0,0,0,0,0,""]
[null,null,0,0,0,0,0,0,0,""]
[null,null,0,0,0,0,0,0,0,"",null,{"$f":"SUM(L173:L249)","v":0},0,0,0,0,0,0,0,0,0,0,0]
["Total Expenditure by Vote",2,{"$f":"C174+C185+C196+C207+C218+C229+C240+C251+C262++C273+C284+C295+C306+C317+C328","v":391038953.97000015},372190739.43999994,0,14653498.549999999,14653498.549999999,31015894.953333329,-16362396.403333332,{"$error":"#VALUE!"},372190739.43999994,0,0,0,0,0,0,0,0,0,0,0,0]
[null,null,null,null,null,null,null,null,0,"",null,{"$f":"L170-L338","v":0},0,0,0,0,0,0,0,0,0,0,0]
[{"$f":"result","v":"Surplus/ (Deficit) for the year"},2,{"$f":"C171-C339","v":28315178.23999989},64870260.560000062,0,-6131670.959999999,-6131670.959999999,5405855.0466666706,-11537526.006666668,{"$error":"#VALUE!"},64870260.560000062,0,0,0,0,0,0,0,0,0,0,0,0,0]
[{"$f":"head27a","v":"References"}]
["1. Insert 'Vote'; e.g. Department, if different to standard structure"]
["2. Must reconcile to Financial Performance ('Revenue and Expenditure by Standard Classification' and 'Revenue and Expenditure')"]
["3. Assign share in 'associate' to relevant Vote"]
[]
["check revenue"]
["check expenditure"]

{"sheet":"C4-FinPerf RE","index":11,"n_rows":53,"n_cols":11,"rows_kept":53,"cut":false,"hidden":false,"merged":[[1,0,2,0],[1,1,2,1],[1,3,1,10],[0,0,0,10]]}
[{"$f":"muni& \" - \"&S71B& \" - \"&date","v":"LIM331 Greater Giyani - Table C4 Monthly Budget Statement - Financial Performance (revenue and expenditure) - M01 July"}]
[{"$f":"desc","v":"Description"},{"$f":"head27","v":"Ref"},{"$f":"Head1","v":"2018/19"},{"$f":"Head2","v":"Budget Year 2019/20"}]
[null,null,{"$f":"Head5","v":"Audited Outcome"},{"$f":"Head6","v":"Original Budget"},{"$f":"Head7","v":"Adjusted Budget"},{"$f":"Head38","v":"Monthly actual"},{"$f":"Head39","v":"YearTD actual"},{"$f":"Head40","v":"YearTD budget"},{"$f":"Head41","v":"YTD variance"},{"$f":"Head41","v":"YTD variance"},{"$f":"Head8","v":"Full Year Forecast"}]
["R thousands",null,null,null,null,null,null,null,null,"%"]
["Revenue By Source"]
["Property rates",null,40659276.989999995,39976000,0,3575509.5799999996,3575509.5799999996,{"$f":"1/12*D6","v":3331333.333333333},{"$f":"G6-H6","v":244176.24666666659},{"$f":"IF(I6=0,\"\",I6/H6)","v":7.3296852111266741E-2},39976000]
["Service charges - electricity revenue",null,0,0,0,0,0,0,0,"",0]
["Service charges - water revenue",null,0,0,0,0,0,0,0,"",0]
["Service charges - sanitation revenue",null,0,0,0,0,0,0,0,"",0]
["Service charges - refuse revenue",null,4477862.1399999997,5400000,0,406533.39999999991,406533.39999999991,{"$f":"1/12*D10","v":450000},-43466.600000000093,-9.6592444444444647E-2,5400000]
[]
["Rental of facilities and equipment",null,959361.94,1222000,0,80010.86,80010.86,{"$f":"1/12*D12","v":101833.33333333333},-21822.473333333328,-0.21429597381342058,1222000]
["Interest earned - external investments",null,5234951.3800000008,5000000,0,321171.17,321171.17,416666.66666666663,-95495.496666666644,-0.22918919199999996,5000000]
["Interest earned - outstanding debtors",null,15154966.24,3400000,0,2182384.41,2182384.41,283333.33333333331,1899051.0766666669,6.702533211764707,3400000]
["Dividends received",null,0,0,0,0,0,0,0,"",0]
["Fines, penalties and forfeits",null,14710465.629999999,10000000,0,126940,126940,{"$f":"1/12*D16","v":833333.33333333326},-706393.33333333326,-0.84767199999999998,10000000]
["Licences and permits",null,5716227.2400000002,6000000,0,1684160.5,1684160.5,500000,1184160.5,2.3683209999999999,6000000]
["Agency services",null,0,0,0,0,0,0,0,"",0]
["Transfers and subsidies",null,259208395.21000001,303024000,0,{"$f":"'SC6'!F38","v":123674000},{"$f":"F19","v":123674000},101008000,22666000,0.22439806747980359,303024000]
["Other revenue",null,55590.44000000041,2351000,0,145117.67000000001,145117.67000000001,{"$f":"1/12*D20","v":195916.66666666666},-50798.996666666644,-0.25928879625691187,2351000]
["Gains on disposal of PPE",null,0,0,0,0,0,0,0,"",0]
["Total Revenue (excluding capital transfers and contributions)",null,{"$f":"SUM(C6:C10)+SUM(C12:C21)","v":346177097.20999998},376373000,0,132195827.59,132195827.59,107120416.66666667,25075410.923333332,0.23408619667119165,{"$f":"SUM(K6:K10)+SUM(K12:K21)","v":376373000}]
[]
["Expenditure By Type"]
["Employee related costs",null,130474394.06999998,164551019.84000012,0,11004917.579999985,11004917.579999985,{"$f":"1/12*D25","v":13712584.986666676},{"$f":"G25-H25","v":-2707667.4066666905},{"$f":"IF(I25=0,\"\",I25/H25)","v":-0.1974585688474835},164551019.84000012]
["Remuneration of councillors",null,22755072.120000005,23922552.370000001,0,1877888.67,1877888.67,1993546.0308333333,-115657.36083333334,-5.8015896821297257E-2,23922552.370000001]
["Debt impairment",null,29161644.739999998,16000000,0,0,0,1333333.3333333333,-1333333.3333333333,-1,16000000]
["Depreciation & asset impairment",null,86419067.38000001,30000000,0,0,0,2500000,-2500000,-1,30000000]
["Finance charges",null,294856.32000000001,0,0,0,0,0,0,"",0]
["Bulk purchases",null,0,0,0,0,0,0,0,"",0]
["Other materials",null,4680660.95,9000000,0,391859.10000000003,391859.10000000003,750000,-358140.89999999997,-0.47752119999999998,9000000]
["Contracted services",null,67631998.780000001,71238008,0,293832.76,293832.76,5936500.666666666,-5642667.9066666663,-0.95050404666003574,71238008]
["Transfers and subsidies",null,22363.95,1000000,0,0,0,83333.333333333328,-83333.333333333328,-1,1000000]
["Other expenditure",null,49591568.829999998,56479159.229999989,0,1085000.4400000002,1085000.4400000002,4706596.6024999991,-3621596.1624999987,-0.7694723955259557,56479159.229999989]
["Loss on disposal of PPE",null,7326.83,0,0,0,0,0,0,"",0]
["Total Expenditure",null,{"$f":"SUM(C25:C35)","v":391038953.96999997},{"$f":"SUM(D25:D35)","v":372190739.44000018},{"$f":"SUM(E25:E35)","v":0},14653498.549999984,14653498.549999984,31015894.953333337,-16362396.403333353,-0.52754874324768941,372190739.44000018]
[]
["Surplus/(Deficit)",null,{"$f":"C22-C36","v":-44861856.75999999},4182260.5599998236,0,117542329.04000002,117542329.04000002,76104521.713333338,{"$f":"I22-I36","v":41437807.326666683},0.54448548382910178,{"$f":"K22-K36","v":4182260.5599998236}]
["Transfers and subsidies - capital (monetary allocations) (National / Provincial and District)",null,73177035,60688000,0,24275000,{"$f":"F39","v":24275000},20229333,{"$f":"G39-H39","v":4045667},0.19999013313983213,60688000]
["Transfers and subsidies - capital (monetary allocations) (National / Provincial Departmental Agencies, Households, Non-profit Institutions, Private Enterprises, Public Corporatons, Higher Educational Institutions)",null,0,0,0,0,0,0,{"$f":"G40-H40","v":0},"",0]
["Transfers and subsidies - capital (in-kind - all) ",null,0,0,0,0,0,0,{"$f":"G41-H41","v":0},"",0]
["Surplus/(Deficit) after capital transfers & contributions",null,{"$f":"C38+SUM(C39:C41)","v":28315178.24000001},64870260.559999824,0,141817329.04000002,141817329.04000002,96333854.713333338,null,null,{"$f":"K38+SUM(K39:K41)","v":64870260.559999824}]
["Taxation",null,null,null,null,null,null,null,{"$f":"G43-H43","v":0},{"$f":"IF(I43=0,\"\",I43/H43)","v":""}]
["Surplus/(Deficit) after taxation",null,{"$f":"C42-C43","v":28315178.24000001},64870260.559999824,0,141817329.04000002,141817329.04000002,96333854.713333338,null,null,{"$f":"K42-K43","v":64870260.559999824}]
["Attributable to minorities"]
["Surplus/(Deficit) attributable to municipality",null,{"$f":"SUM(C44:C45)","v":28315178.24000001},64870260.559999824,0,141817329.04000002,141817329.04000002,96333854.713333338,null,null,{"$f":"SUM(K44:K45)","v":64870260.559999824}]
["Share of surplus/ (deficit) of associate"]
["Surplus/ (Deficit) for the year",null,{"$f":"C46+C47","v":28315178.24000001},64870260.559999824,0,141817329.04000002,141817329.04000002,96333854.713333338,null,null,{"$f":"K46+K47","v":64870260.559999824}]
[{"$f":"head27a","v":"References"}]
["1. Material variances to be explained on Table SC1"]
[]
[]
[{"$f":"A22&\" including capital transfers/contributions etc\"","v":"Total Revenue (excluding capital transfers and contributions) including capital transfers/contributions etc"},null,{"$f":"C22+SUM(C39:C41)","v":419354132.20999998},437061000,0,156470827.59,156470827.59,127349749.66666667,null,null,{"$f":"K22+SUM(K39:K41)","v":437061000}]

{"sheet":"C5-Capex","index":12,"n_rows":86,"n_cols":11,"rows_kept":86,"cut":false,"hidden":false,"merged":[[0,0,0,10],[76,0,76,10],[78,0,78,10],[77,0,77,10],[1,0,2,0],[1,1,2,1]]}
[{"$f":"muni& \" - \"&S71D& \" - \"&date","v":"LIM331 Greater Giyani - Table C5 Monthly Budget Statement - Capital Expenditure (municipal vote, functional classification and funding) - M01 July"}]
[{"$f":"Vdesc","v":"Vote Description"},{"$f":"head27","v":"Ref"},{"$f":"Head1","v":"2018/19"},{"$f":"Head2","v":"Budget Year 2019/20"}]
[null,null,{"$f":"Head5","v":"Audited Outcome"},{"$f":"Head6","v":"Original Budget"},{"$f":"Head7","v":"Adjusted Budget"},{"$f":"Head38","v":"Monthly actual"},{"$f":"Head39","v":"YearTD actual"},{"$f":"Head40","v":"YearTD budget"},{"$f":"Head41","v":"YTD variance"},{"$f":"Head41","v":"YTD variance"},{"$f":"Head8","v":"Full Year Forecast"}]
["R thousands",1,null,null,null,null,null,null,null,"%"]
["Multi-Year expenditure appropriation",2]
[{"$f":"'Org structure'!A2","v":"Vote 1 - Energy Sources"},null,{"$f":"'C5C'!C7","v":0},{"$f":"'C5C'!D7","v":1400000},{"$f":"'C5C'!E7","v":0},{"$f":"'C5C'!F7","v":0},{"$f":"'C5C'!G7","v":0},{"$f":"'C5C'!H7","v":116666.66666666666},{"$f":"G6-H6","v":-116666.66666666666},{"$f":"IF(I6=0,\"\",I6/H6)","v":-1},{"$f":"'C5C'!K7","v":1400000}]
[{"$f":"'Org structure'!A3","v":"Vote 2 - Community and Social Services"},null,{"$f":"'C5C'!C18","v":7438669},{"$f":"'C5C'!D18","v":100000},{"$f":"'C5C'!E18","v":0},{"$f":"'C5C'!F18","v":0},{"$f":"'C5C'!G18","v":0},{"$f":"'C5C'!H18","v":8333.3333333333321},{"$f":"G7-H7","v":-8333.3333333333321},{"$f":"IF(I7=0,\"\",I7/H7)","v":-1},{"$f":"'C5C'!K18","v":100000}]
[{"$f":"'Org structure'!A4","v":"Vote 3 - Finance & Administration"},null,{"$f":"'C5C'!C29","v":4716695},{"$f":"'C5C'!D29","v":500000},{"$f":"'C5C'!E29","v":0},{"$f":"'C5C'!F29","v":0},{"$f":"'C5C'!G29","v":0},{"$f":"'C5C'!H29","v":41666.666666666664},{"$f":"G8-H8","v":-41666.666666666664},{"$f":"IF(I8=0,\"\",I8/H8)","v":-1},{"$f":"'C5C'!K29","v":500000}]
[{"$f":"'Org structure'!A5","v":"Vote 4 - Planning and Development"},null,{"$f":"'C5C'!C40","v":0},{"$f":"'C5C'!D40","v":1166666},{"$f":"'C5C'!E40","v":0},{"$f":"'C5C'!F40","v":0},{"$f":"'C5C'!G40","v":0},{"$f":"'C5C'!H40","v":97222.166666666657},-97222.166666666657,-1,{"$f":"'C5C'!K40","v":1166666}]
[{"$f":"'Org structure'!A6","v":"Vote 5 - Executive & Council"},null,{"$f":"'C5C'!C51","v":0},{"$f":"'C5C'!D51","v":0},{"$f":"'C5C'!E51","v":0},{"$f":"'C5C'!F51","v":0},{"$f":"'C5C'!G51","v":0},{"$f":"'C5C'!H51","v":0},0,"",{"$f":"'C5C'!K51","v":0}]
[{"$f":"'Org structure'!A7","v":"Vote 6 - Internal Audit"},null,{"$f":"'C5C'!C62","v":0},{"$f":"'C5C'!D62","v":0},{"$f":"'C5C'!E62","v":0},{"$f":"'C5C'!F62","v":0},{"$f":"'C5C'!G62","v":0},{"$f":"'C5C'!H62","v":0},0,"",{"$f":"'C5C'!K62","v":0}]
[{"$f":"'Org structure'!A8","v":"Vote 7 - Road Transport"},null,{"$f":"'C5C'!C73","v":47267449},{"$f":"'C5C'!D73","v":40002820},{"$f":"'C5C'!E73","v":0},{"$f":"'C5C'!F73","v":0},{"$f":"'C5C'!G73","v":0},{"$f":"'C5C'!H73","v":3333568.333333333},-3333568.333333333,-1,{"$f":"'C5C'!K73","v":40002820}]
[{"$f":"'Org structure'!A9","v":"Vote 8 - Public Safety"},null,{"$f":"'C5C'!C84","v":0},{"$f":"'C5C'!D84","v":0},{"$f":"'C5C'!E84","v":0},{"$f":"'C5C'!F84","v":0},{"$f":"'C5C'!G84","v":0},{"$f":"'C5C'!H84","v":0},0,"",{"$f":"'C5C'!K84","v":0}]
[{"$f":"'Org structure'!A10","v":"Vote 9 - Waste Management"},null,{"$f":"'C5C'!C95","v":0},{"$f":"'C5C'!D95","v":12500000},{"$f":"'C5C'!E95","v":0},{"$f":"'C5C'!F95","v":0},{"$f":"'C5C'!G95","v":0},{"$f":"'C5C'!H95","v":1041666.6666666666},-1041666.6666666666,-1,{"$f":"'C5C'!K95","v":12500000}]
[{"$f":"'Org structure'!A11","v":"Vote 10 - Sports & Recreation"},null,{"$f":"'C5C'!C106","v":0},{"$f":"'C5C'!D106","v":23250780},{"$f":"'C5C'!E106","v":0},{"$f":"'C5C'!F106","v":0},{"$f":"'C5C'!G106","v":0},{"$f":"'C5C'!H106","v":1937564.9999999998},-1937564.9999999998,-1,{"$f":"'C5C'!K106","v":23250780}]
[{"$f":"'Org structure'!A12","v":"Vote 11 - Water Management"},null,{"$f":"'C5C'!C117","v":0},{"$f":"'C5C'!D117","v":0},{"$f":"'C5C'!E117","v":0},{"$f":"'C5C'!F117","v":0},{"$f":"'C5C'!G117","v":0},{"$f":"'C5C'!H117","v":0},0,"",{"$f":"'C5C'!K117","v":0}]
[{"$f":"'Org structure'!A13","v":"Vote 12 - Waste Water Management"},null,{"$f":"'C5C'!C128","v":0},{"$f":"'C5C'!D128","v":0},{"$f":"'C5C'!E128","v":0},{"$f":"'C5C'!F128","v":0},{"$f":"'C5C'!G128","v":0},{"$f":"'C5C'!H128","v":0},0,"",{"$f":"'C5C'!K128","v":0}]
[{"$f":"'Org structure'!A14","v":"Vote 13 - Housing"},null,{"$f":"'C5C'!C139","v":0},{"$f":"'C5C'!D139","v":0},{"$f":"'C5C'!E139","v":0},{"$f":"'C5C'!F139","v":0},{"$f":"'C5C'!G139","v":0},{"$f":"'C5C'!H139","v":0},{"$f":"G18-H18","v":0},{"$f":"IF(I18=0,\"\",I18/H18)","v":""},{"$f":"'C5C'!K139","v":0}]
[{"$f":"'Org structure'!A15","v":"Vote 14 - Finance & Administration"},null,{"$f":"'C5C'!C150","v":0},{"$f":"'C5C'!D150","v":22450000},{"$f":"'C5C'!E150","v":0},{"$f":"'C5C'!F150","v":0},{"$f":"'C5C'!G150","v":0},{"$f":"'C5C'!H150","v":1870833.3333333333},{"$f":"G19-H19","v":-1870833.3333333333},{"$f":"IF(I19=0,\"\",I19/H19)","v":-1},{"$f":"'C5C'!K150","v":22450000}]
[{"$f":"'Org structure'!A16","v":"Vote 15 - [NAME OF VOTE 5]"},null,{"$f":"'C5C'!C161","v":0},{"$f":"'C5C'!D161","v":0},{"$f":"'C5C'!E161","v":0},{"$f":"'C5C'!F161","v":0},{"$f":"'C5C'!G161","v":0},{"$f":"'C5C'!H161","v":0},{"$f":"G20-H20","v":0},{"$f":"IF(I20=0,\"\",I20/H20)","v":""},{"$f":"'C5C'!K161","v":0}]
["Total Capital Multi-year expenditure","4,7",{"$f":"SUM(C6:C20)","v":59422813},{"$f":"SUM(D6:D20)","v":101370266},0,0,0,8447522.166666666,-8447522.166666666,{"$f":"IF(I21=0,\"\",I21/H21)","v":-1},{"$f":"SUM(K6:K20)","v":101370266}]
[]
["Single Year expenditure appropriation",2]
[{"$f":"'Org structure'!A2","v":"Vote 1 - Energy Sources"},null,{"$f":"'C5C'!C176","v":115814},{"$f":"'C5C'!D176","v":300000},{"$f":"'C5C'!E176","v":0},{"$f":"'C5C'!F176","v":0},{"$f":"'C5C'!G176","v":0},{"$f":"'C5C'!H176","v":25000},{"$f":"'C5C'!I176","v":-25000},{"$f":"IF(I24=0,\"\",I24/H24)","v":-1},{"$f":"'C5C'!K176","v":300000}]
[{"$f":"'Org structure'!A3","v":"Vote 2 - Community and Social Services"},null,{"$f":"'C5C'!C187","v":0},{"$f":"'C5C'!D187","v":0},{"$f":"'C5C'!E187","v":0},{"$f":"'C5C'!F187","v":0},{"$f":"'C5C'!G187","v":0},{"$f":"'C5C'!H187","v":0},{"$f":"'C5C'!I187","v":0},{"$f":"IF(I25=0,\"\",I25/H25)","v":""},{"$f":"'C5C'!K187","v":0}]
[{"$f":"'Org structure'!A4","v":"Vote 3 - Finance & Administration"},null,{"$f":"'C5C'!C198","v":2417221},{"$f":"'C5C'!D198","v":2500000},{"$f":"'C5C'!E198","v":0},{"$f":"'C5C'!F198","v":0},{"$f":"'C5C'!G198","v":0},{"$f":"'C5C'!H198","v":208333.33333333331},{"$f":"'C5C'!I198","v":-208333.33333333331},-1,{"$f":"'C5C'!K198","v":2500000}]
[{"$f":"'Org structure'!A5","v":"Vote 4 - Planning and Development"},null,{"$f":"'C5C'!C209","v":0},{"$f":"'C5C'!D209","v":0},{"$f":"'C5C'!E209","v":0},{"$f":"'C5C'!F209","v":0},{"$f":"'C5C'!G209","v":0},{"$f":"'C5C'!H209","v":0},{"$f":"'C5C'!I209","v":0},"",{"$f":"'C5C'!K209","v":0}]
[{"$f":"'Org structure'!A6","v":"Vote 5 - Executive & Council"},null,{"$f":"'C5C'!C220","v":0},{"$f":"'C5C'!D220","v":0},{"$f":"'C5C'!E220","v":0},{"$f":"'C5C'!F220","v":0},{"$f":"'C5C'!G220","v":0},{"$f":"'C5C'!H220","v":0},{"$f":"'C5C'!I220","v":0},"",{"$f":"'C5C'!K220","v":0}]
[{"$f":"'Org structure'!A7","v":"Vote 6 - Internal Audit"},null,{"$f":"'C5C'!C231","v":0},{"$f":"'C5C'!D231","v":0},{"$f":"'C5C'!E231","v":0},{"$f":"'C5C'!F231","v":0},{"$f":"'C5C'!G231","v":0},{"$f":"'C5C'!H231","v":0},{"$f":"'C5C'!I231","v":0},"",{"$f":"'C5C'!K231","v":0}]
[{"$f":"'Org structure'!A8","v":"Vote 7 - Road Transport"},null,{"$f":"'C5C'!C242","v":0},{"$f":"'C5C'!D242","v":600000},{"$f":"'C5C'!E242","v":0},{"$f":"'C5C'!F242","v":0},{"$f":"'C5C'!G242","v":0},{"$f":"'C5C'!H242","v":50000},{"$f":"'C5C'!I242","v":-50000},-1,{"$f":"'C5C'!K242","v":600000}]
[{"$f":"'Org structure'!A9","v":"Vote 8 - Public Safety"},null,{"$f":"'C5C'!C253","v":0},{"$f":"'C5C'!D253","v":0},{"$f":"'C5C'!E253","v":0},{"$f":"'C5C'!F253","v":0},{"$f":"'C5C'!G253","v":0},{"$f":"'C5C'!H253","v":0},{"$f":"'C5C'!I253","v":0},"",{"$f":"'C5C'!K253","v":0}]
[{"$f":"'Org structure'!A10","v":"Vote 9 - Waste Management"},null,{"$f":"'C5C'!C264","v":0},{"$f":"'C5C'!D264","v":100000},{"$f":"'C5C'!E264","v":0},{"$f":"'C5C'!F264","v":0},{"$f":"'C5C'!G264","v":0},{"$f":"'C5C'!H264","v":8333.3333333333321},{"$f":"'C5C'!I264","v":-8333.3333333333321},-1,{"$f":"'C5C'!K264","v":100000}]
[{"$f":"'Org structure'!A11","v":"Vote 10 - Sports & Recreation"},null,{"$f":"'C5C'!C275","v":0},{"$f":"'C5C'!D275","v":0},{"$f":"'C5C'!E275","v":0},{"$f":"'C5C'!F275","v":0},{"$f":"'C5C'!G275","v":0},{"$f":"'C5C'!H275","v":0},{"$f":"'C5C'!I275","v":0},"",{"$f":"'C5C'!K275","v":0}]
[{"$f":"'Org structure'!A12","v":"Vote 11 - Water Management"},null,{"$f":"'C5C'!C286","v":0},{"$f":"'C5C'!D286","v":0},{"$f":"'C5C'!E286","v":0},{"$f":"'C5C'!F286","v":0},{"$f":"'C5C'!G286","v":0},{"$f":"'C5C'!H286","v":0},{"$f":"'C5C'!I286","v":0},"",{"$f":"'C5C'!K286","v":0}]
[{"$f":"'Org structure'!A13","v":"Vote 12 - Waste Water Management"},null,{"$f":"'C5C'!C297","v":0},{"$f":"'C5C'!D297","v":0},{"$f":"'C5C'!E297","v":0},{"$f":"'C5C'!F297","v":0},{"$f":"'C5C'!G297","v":0},{"$f":"'C5C'!H297","v":0},{"$f":"'C5C'!I297","v":0},"",{"$f":"'C5C'!K297","v":0}]
[{"$f":"'Org structure'!A14","v":"Vote 13 - Housing"},null,{"$f":"'C5C'!C308","v":0},{"$f":"'C5C'!D308","v":0},{"$f":"'C5C'!E308","v":0},{"$f":"'C5C'!F308","v":0},{"$f":"'C5C'!G308","v":0},{"$f":"'C5C'!H308","v":0},{"$f":"'C5C'!I308","v":0},"",{"$f":"'C5C'!K308","v":0}]
[{"$f":"'Org structure'!A15","v":"Vote 14 - Finance & Administration"},null,{"$f":"'C5C'!C319","v":2508263},{"$f":"'C5C'!D319","v":5000000},{"$f":"'C5C'!E319","v":0},{"$f":"'C5C'!F319","v":0},{"$f":"'C5C'!G319","v":0},{"$f":"'C5C'!H319","v":416666.66666666663},{"$f":"'C5C'!I319","v":-416666.66666666663},-1,{"$f":"'C5C'!K319","v":5000000}]
[{"$f":"'Org structure'!A16","v":"Vote 15 - [NAME OF VOTE 5]"},null,{"$f":"'C5C'!C330","v":0},{"$f":"'C5C'!D330","v":0},{"$f":"'C5C'!E330","v":0},{"$f":"'C5C'!F330","v":0},{"$f":"'C5C'!G330","v":0},{"$f":"'C5C'!H330","v":0},{"$f":"'C5C'!I330","v":0},"",{"$f":"'C5C'!K330","v":0}]
["Total Capital single-year expenditure",4,{"$f":"SUM(C24:C38)","v":5041298},8500000,0,0,0,708333.33333333326,-708333.33333333326,-1,{"$f":"SUM(K24:K38)","v":8500000}]
["Total Capital Expenditure",null,{"$f":"C39+C21","v":64464111},109870266,0,0,0,9155855.5,-9155855.5,{"$f":"IF(I40=0,\"\",I40/H40)","v":-1},{"$f":"K39+K21","v":109870266}]
[]
["Capital Expenditure - Functional Classification"]
["Governance and administration",null,{"$f":"SUM(C44:C46)","v":9642179},31400000,0,0,0,2616666.6666666665,{"$f":"G43-H43","v":-2616666.6666666665},{"$f":"IF(I43=0,\"\",I43/H43)","v":-1},{"$f":"SUM(K44:K46)","v":31400000}]
["Executive and council",null,0,0,0,0,0,{"$f":"1/12*D44","v":0},0,{"$f":"IF(I44=0,\"\",I44/H44)","v":""},0]
["Finance and administration",null,9642179,31400000,0,0,0,{"$f":"1/12*D45","v":2616666.6666666665},-2616666.6666666665,-1,31400000]
["Internal audit",null,0,0,0,0,0,0,0,"",0]
["Community and public safety",null,{"$f":"SUM(C48:C52)","v":7438669},25400780,0,0,0,2116731.6666666665,-2116731.6666666665,-1,{"$f":"SUM(K48:K52)","v":25400780}]
["Community and social services",null,0,100000,0,0,0,{"$f":"1/12*D48","v":8333.3333333333321},-8333.3333333333321,-1,100000]
["Sport and recreation",null,7438669,25250780,0,0,0,2104231.6666666665,-2104231.6666666665,-1,25250780]
["Public safety",null,0,50000,0,0,0,4166.6666666666661,-4166.6666666666661,-1,50000]
["Housing",null,0,0,0,0,0,0,0,"",0]
["Health",null,0,0,0,0,0,0,0,"",0]
["Economic and environmental services",null,{"$f":"SUM(C54:C56)","v":47267449},38769486,0,0,0,3230790.4999999995,-3230790.4999999995,-1,{"$f":"SUM(K54:K56)","v":38769486}]
["Planning and development",null,0,1166666,0,0,0,{"$f":"1/12*D54","v":97222.166666666657},-97222.166666666657,-1,1166666]
["Road transport",null,47267449,37602820,0,0,0,3133568.333333333,-3133568.333333333,-1,37602820]
["Environmental protection",null,0,0,0,0,0,0,0,"",0]
["Trading services",null,{"$f":"SUM(C58:C61)","v":115814},14300000,0,0,0,1191666.6666666667,-1191666.6666666667,-1,{"$f":"SUM(K58:K61)","v":14300000}]
["Energy sources",null,115814,1700000,0,0,0,{"$f":"1/12*D58","v":141666.66666666666},-141666.66666666666,-1,1700000]
["Water management",null,0,0,0,0,0,0,0,"",0]
["Waste water management",null,0,0,0,0,0,0,0,"",0]
["Waste management",null,0,12600000,0,0,0,1050000,-1050000,-1,12600000]
["Other",null,0,0,0,0,0,0,0,"",0]
["Total Capital Expenditure - Functional Classification",3,{"$f":"C43+C47+C53+C57+C62","v":64464111},{"$f":"D43+D47+D53+D57+D62","v":109870266},0,0,0,9155855.4999999981,-9155855.4999999981,-1,{"$f":"K43+K47+K53+K57+K62","v":109870266}]
[]
["Funded by:"]
["National Government",null,54706118,57653600,0,0,0,{"$f":"1/12*D66","v":4804466.666666666},{"$f":"G66-H66","v":-4804466.666666666},{"$f":"IF(I66=0,\"\",I66/H66)","v":-1},57653600]
["Provincial Government",null,0,0,0,0,0,0,0,"",0]
["District Municipality",null,0,0,0,0,0,0,0,"",0]
["Other transfers and grants",null,0,0,0,0,0,0,0,"",0]
["Transfers recognised - capital",null,{"$f":"SUM(C66:C69)","v":54706118},57653600,0,0,0,4804466.666666666,-4804466.666666666,-1,{"$f":"SUM(K66:K69)","v":57653600}]
[]
["Borrowing",6,0,0,0,0,0,{"$f":"1/12*D72","v":0},0,"",0]
["Internally generated funds",null,9757993,52216666,0,0,0,4351388.833333333,-4351388.833333333,-1,{"$f":"D73","v":52216666}]
["Total Capital Funding",null,{"$f":"+C70+C72+C73","v":64464111},109870266,0,0,0,9155855.5,-9155855.5,-1,{"$f":"+K70+K72+K73","v":109870266}]
[{"$f":"head27a","v":"References"}]
["1. Municipalities may choose to appropriate for capital expenditure for three years or for one year (if one year appropriation projected expenditure required for yr2 and yr3)."]
["2. Include capital component of PPP unitary payment"]
["3. Capital expenditure by functional classification must reconcile to the total of multi-year and single year appropriations"]
["4. Include expenditure on investment property, intangible and biological assets"]
[]
["6. Include finance leases and PPP capital funding component of unitary payment - total borrowing/repayments to reconcile to changes in Table SA17"]
[]
[]
[]
[]
["check balance",null,{"$f":"C40-C74","v":0},{"$f":"D40-D74","v":0},0,0,0,0,null,null,0]

{"sheet":"C5C","index":13,"n_rows":345,"n_cols":23,"rows_kept":345,"cut":false,"hidden":false,"merged":[[1,3,1,10],[1,11,1,22],[0,0,0,10]]}
[{"$f":"muni& \" - \"&S71D& \" - \"&\"A\"& \" - \"&date","v":"LIM331 Greater Giyani - Table C5 Monthly Budget Statement - Capital Expenditure (municipal vote, functional classification and funding) - A - M01 July"}]
[{"$f":"Vdesc","v":"Vote Description"},{"$f":"head27","v":"Ref"},{"$f":"Head1","v":"2018/19"},{"$f":"Head2","v":"Budget Year 2019/20"},null,null,null,null,null,null,null,{"$f":"Head4","v":{"$error":"#REF!"}}]
["R thousand",null,{"$f":"Head5","v":"Audited Outcome"},{"$f":"Head6","v":"Original Budget"},{"$f":"Head7","v":"Adjusted Budget"},{"$f":"Head38","v":"Monthly actual"},{"$f":"Head39","v":"YearTD actual"},{"$f":"Head40","v":"YearTD budget"},{"$f":"Head41","v":"YTD variance"},{"$f":"Head41","v":"YTD variance"},{"$f":"Head8","v":"Full Year Forecast"},{"$f":"Head12","v":"Forecast 2010/11"},{"$f":"Head13","v":"Forecast 2011/12"},{"$f":"Head14","v":"Forecast 2012/13"},{"$f":"Head15","v":"Forecast 2013/14"},{"$f":"Head16","v":"Forecast 2014/15"},{"$f":"Head17","v":"Forecast 2015/16"},{"$f":"Head18","v":"Forecast 2016/17"},{"$f":"Head19","v":"Forecast 2017/18"},{"$f":"Head20","v":"Forecast 2018/19"},{"$f":"Head21","v":"Forecast 2019/20"},{"$f":"Head22","v":"Forecast 2020/21"},{"$f":"Head23","v":"Forecast 2021/22"}]
[null,null,null,null,null,null,null,null,null,"%"]
["Capital expenditure - Municipal Vote"]
["Expenditure of multi-year capital appropriation",1]
[{"$f":"'Org structure'!A2","v":"Vote 1 - Energy Sources"},null,{"$f":"SUM(C8:C17)","v":0},{"$f":"SUM(D8:D17)","v":1400000},0,0,0,116666.66666666666,{"$f":"G7-H7","v":-116666.66666666666},{"$f":"IF(I7=0,\"\",I7/H7)","v":-1},1400000]
[{"$f":"IF(RIGHT('Org structure'!D3,18)<>\"[Name of sub-vote]\",'Org structure'!D3,\"\")","v":"1.1 - Electricity"},null,null,null,null,null,null,{"$f":"1/12*D8","v":0},0,""]
[{"$f":"IF(RIGHT('Org structure'!D4,18)<>\"[Name of sub-vote]\",'Org structure'!D4,\"\")","v":"1.2 - Street Lighting and Signal Systems"},null,null,1400000,null,null,null,{"$f":"1/12*D9","v":116666.66666666666},-116666.66666666666,-1,1400000]
[{"$f":"IF(RIGHT('Org structure'!D5,18)<>\"[Name of sub-vote]\",'Org structure'!D5,\"\")","v":""},null,null,null,null,null,null,null,0,""]
[{"$f":"IF(RIGHT('Org structure'!D6,18)<>\"[Name of sub-vote]\",'Org structure'!D6,\"\")","v":""},null,null,null,null,null,null,null,0,""]
[{"$f":"IF(RIGHT('Org structure'!D7,18)<>\"[Name of sub-vote]\",'Org structure'!D7,\"\")","v":""},null,null,null,null,null,null,null,0,""]
[{"$f":"IF(RIGHT('Org structure'!D8,18)<>\"[Name of sub-vote]\",'Org structure'!D8,\"\")","v":""},null,null,null,null,null,null,null,0,""]
[{"$f":"IF(RIGHT('Org structure'!D9,18)<>\"[Name of sub-vote]\",'Org structure'!D9,\"\")","v":""},null,null,null,null,null,null,null,0,""]
[{"$f":"IF(RIGHT('Org structure'!D10,18)<>\"[Name of sub-vote]\",'Org structure'!D10,\"\")","v":""},null,null,null,null,null,null,null,0,""]
[{"$f":"IF(RIGHT('Org structure'!D11,18)<>\"[Name of sub-vote]\",'Org structure'!D11,\"\")","v":""},null,null,null,null,null,null,null,0,""]
[{"$f":"IF(RIGHT('Org structure'!D12,18)<>\"[Name of sub-vote]\",'Org structure'!D12,\"\")","v":""},null,null,null,null,null,null,null,0,""]
[{"$f":"'Org structure'!A3","v":"Vote 2 - Community and Social Services"},null,{"$f":"SUM(C19:C28)","v":7438669},{"$f":"SUM(D19:D28)","v":100000},0,0,0,8333.3333333333321,-8333.3333333333321,-1,100000]
[{"$f":"IF(RIGHT('Org structure'!D14,18)<>\"[Name of sub-vote]\",'Org structure'!D14,\"\")","v":"2.1 - Animal Care and Diseases"},null,null,null,null,null,null,{"$f":"1/12*D19","v":0},0,""]
[{"$f":"IF(RIGHT('Org structure'!D15,18)<>\"[Name of sub-vote]\",'Org structure'!D15,\"\")","v":"2.2 - Community Halls and Facilities"},null,7438669,100000,null,null,null,{"$f":"1/12*D20","v":8333.3333333333321},-8333.3333333333321,-1,100000]
[{"$f":"IF(RIGHT('Org structure'!D16,18)<>\"[Name of sub-vote]\",'Org structure'!D16,\"\")","v":"2.3 - Libraries and Archives"},null,null,null,null,null,null,{"$f":"1/12*D21","v":0},0,""]
[{"$f":"IF(RIGHT('Org structure'!D17,18)<>\"[Name of sub-vote]\",'Org structure'!D17,\"\")","v":"2.4 - Cemeteries, Funeral Parlours and Crematoriums"},null,null,null,null,null,null,{"$f":"1/12*D22","v":0},0,""]
[{"$f":"IF(RIGHT('Org structure'!D18,18)<>\"[Name of sub-vote]\",'Org structure'!D18,\"\")","v":"2.5 - Disaster Management"},null,null,null,null,null,null,{"$f":"1/12*D23","v":0},0,""]
[{"$f":"IF(RIGHT('Org structure'!D19,18)<>\"[Name of sub-vote]\",'Org structure'!D19,\"\")","v":""},null,null,null,null,null,null,null,0,""]
[{"$f":"IF(RIGHT('Org structure'!D20,18)<>\"[Name of sub-vote]\",'Org structure'!D20,\"\")","v":""},null,null,null,null,null,null,null,0,""]
[{"$f":"IF(RIGHT('Org structure'!D21,18)<>\"[Name of sub-vote]\",'Org structure'!D21,\"\")","v":""},null,null,null,null,null,null,null,0,""]
[{"$f":"IF(RIGHT('Org structure'!D22,18)<>\"[Name of sub-vote]\",'Org structure'!D22,\"\")","v":""},null,null,null,null,null,null,null,0,""]
[{"$f":"IF(RIGHT('Org structure'!D23,18)<>\"[Name of sub-vote]\",'Org structure'!D23,\"\")","v":""},null,null,null,null,null,null,null,0,""]
[{"$f":"'Org structure'!A4","v":"Vote 3 - Finance & Administration"},null,{"$f":"SUM(C30:C39)","v":4716695},500000,0,0,0,41666.666666666664,-41666.666666666664,-1,500000]
[{"$f":"IF(RIGHT('Org structure'!D25,18)<>\"[Name of sub-vote]\",'Org structure'!D25,\"\")","v":"3.1 - Fleet Management"},null,null,null,null,null,null,{"$f":"1/12*D30","v":0},0,""]
[{"$f":"IF(RIGHT('Org structure'!D26,18)<>\"[Name of sub-vote]\",'Org structure'!D26,\"\")","v":"3.2 - Finance"},null,null,null,null,null,null,0,0,""]
[{"$f":"IF(RIGHT('Org structure'!D27,18)<>\"[Name of sub-vote]\",'Org structure'!D27,\"\")","v":"3.3 - Asset Management"},null,null,null,null,null,null,0,0,""]
[{"$f":"IF(RIGHT('Org structure'!D28,18)<>\"[Name of sub-vote]\",'Org structure'!D28,\"\")","v":"3.4 - Human Resources"},null,null,null,null,null,null,0,0,""]
[{"$f":"IF(RIGHT('Org structure'!D29,18)<>\"[Name of sub-vote]\",'Org structure'!D29,\"\")","v":"3.5 - Legal Services"},null,null,500000,null,null,null,41666.666666666664,-41666.666666666664,-1,500000]
[{"$f":"IF(RIGHT('Org structure'!D30,18)<>\"[Name of sub-vote]\",'Org structure'!D30,\"\")","v":"3.6 - Property Services"},null,4716695,null,null,null,null,0,0,""]
[{"$f":"IF(RIGHT('Org structure'!D31,18)<>\"[Name of sub-vote]\",'Org structure'!D31,\"\")","v":"3.7 - Risk Management"},null,null,null,null,null,null,0,0,""]
[{"$f":"IF(RIGHT('Org structure'!D32,18)<>\"[Name of sub-vote]\",'Org structure'!D32,\"\")","v":"3.8 - Supply Chain Management"},null,null,null,null,null,null,0,0,""]
[{"$f":"IF(RIGHT('Org structure'!D33,18)<>\"[Name of sub-vote]\",'Org structure'!D33,\"\")","v":""},null,null,null,null,null,null,null,0,""]
[{"$f":"IF(RIGHT('Org structure'!D34,18)<>\"[Name of sub-vote]\",'Org structure'!D34,\"\")","v":""},null,null,null,null,null,null,null,0,""]
[{"$f":"'Org structure'!A5","v":"Vote 4 - Planning and Development"},null,{"$f":"SUM(C41:C50)","v":0},1166666,0,0,0,97222.166666666657,-97222.166666666657,-1,1166666]
[{"$f":"IF(RIGHT('Org structure'!D36,18)<>\"[Name of sub-vote]\",'Org structure'!D36,\"\")","v":"4.1 - Town Planning, Building Regulations and Enforcement, and City Engineer"},null,null,null,null,null,null,{"$f":"1/12*D41","v":0},0,""]
[{"$f":"IF(RIGHT('Org structure'!D37,18)<>\"[Name of sub-vote]\",'Org structure'!D37,\"\")","v":"4.2 - Corporate Wide Strategic Planning (IDPs, LEDs)"},null,null,1166666,null,null,null,{"$f":"1/12*D42","v":97222.166666666657},-97222.166666666657,-1,1166666]
[{"$f":"IF(RIGHT('Org structure'!D38,18)<>\"[Name of sub-vote]\",'Org structure'!D38,\"\")","v":"4.3 - Economic Development/Planning"},null,null,null,null,null,null,{"$f":"1/12*D43","v":0},0,""]
[{"$f":"IF(RIGHT('Org structure'!D39,18)<>\"[Name of sub-vote]\",'Org structure'!D39,\"\")","v":"4.4 - Project Management Unit"},null,null,null,null,null,null,{"$f":"1/12*D44","v":0},0,""]
[{"$f":"IF(RIGHT('Org structure'!D40,18)<>\"[Name of sub-vote]\",'Org structure'!D40,\"\")","v":""},null,null,null,null,null,null,null,0,""]
[{"$f":"IF(RIGHT('Org structure'!D41,18)<>\"[Name of sub-vote]\",'Org structure'!D41,\"\")","v":""},null,null,null,null,null,null,null,0,""]
[{"$f":"IF(RIGHT('Org structure'!D42,18)<>\"[Name of sub-vote]\",'Org structure'!D42,\"\")","v":""},null,null,null,null,null,null,null,0,""]
[{"$f":"IF(RIGHT('Org structure'!D43,18)<>\"[Name of sub-vote]\",'Org structure'!D43,\"\")","v":""},null,null,null,null,null,null,null,0,""]
[{"$f":"IF(RIGHT('Org structure'!D44,18)<>\"[Name of sub-vote]\",'Org structure'!D44,\"\")","v":""},null,null,null,null,null,null,null,0,""]
[{"$f":"IF(RIGHT('Org structure'!D45,18)<>\"[Name of sub-vote]\",'Org structure'!D45,\"\")","v":""},null,null,null,null,null,null,null,0,""]
[{"$f":"'Org structure'!A6","v":"Vote 5 - Executive & Council"},null,{"$f":"SUM(C52:C61)","v":0},{"$f":"SUM(D52:D61)","v":0},0,0,0,0,0,"",0]
[{"$f":"IF(RIGHT('Org structure'!D47,18)<>\"[Name of sub-vote]\",'Org structure'!D47,\"\")","v":"5.1 - Municipal Manager, Town Secretary and Chief Executive"},null,null,null,null,null,null,{"$f":"1/12*D52","v":0},0,""]
[{"$f":"IF(RIGHT('Org structure'!D48,18)<>\"[Name of sub-vote]\",'Org structure'!D48,\"\")","v":"5.2 - Mayor and Council"},null,null,null,null,null,null,{"$f":"1/12*D53","v":0},0,""]
[{"$f":"IF(RIGHT('Org structure'!D49,18)<>\"[Name of sub-vote]\",'Org structure'!D49,\"\")","v":""},null,null,null,null,null,null,null,0,""]
[{"$f":"IF(RIGHT('Org structure'!D50,18)<>\"[Name of sub-vote]\",'Org structure'!D50,\"\")","v":""},null,null,null,null,null,null,null,0,""]
[{"$f":"IF(RIGHT('Org structure'!D51,18)<>\"[Name of sub-vote]\",'Org structure'!D51,\"\")","v":""},null,null,null,null,null,null,null,0,""]
[{"$f":"IF(RIGHT('Org structure'!D52,18)<>\"[Name of sub-vote]\",'Org structure'!D52,\"\")","v":""},null,null,null,null,null,null,null,0,""]
[{"$f":"IF(RIGHT('Org structure'!D53,18)<>\"[Name of sub-vote]\",'Org structure'!D53,\"\")","v":""},null,null,null,null,null,null,null,0,""]
[{"$f":"IF(RIGHT('Org structure'!D54,18)<>\"[Name of sub-vote]\",'Org structure'!D54,\"\")","v":""},null,null,null,null,null,null,null,0,""]
[{"$f":"IF(RIGHT('Org structure'!D55,18)<>\"[Name of sub-vote]\",'Org structure'!D55,\"\")","v":""},null,null,null,null,null,null,null,0,""]
[{"$f":"IF(RIGHT('Org structure'!D56,18)<>\"[Name of sub-vote]\",'Org structure'!D56,\"\")","v":""},null,null,null,null,null,null,null,0,""]
[{"$f":"'Org structure'!A7","v":"Vote 6 - Internal Audit"},null,{"$f":"SUM(C63:C72)","v":0},{"$f":"SUM(D63:D72)","v":0},0,0,0,0,0,"",0]
[{"$f":"IF(RIGHT('Org structure'!D58,18)<>\"[Name of sub-vote]\",'Org structure'!D58,\"\")","v":"6.1 - Governance Function"},null,null,null,null,null,null,{"$f":"1/12*D63","v":0},0,""]
[{"$f":"IF(RIGHT('Org structure'!D59,18)<>\"[Name of sub-vote]\",'Org structure'!D59,\"\")","v":""},null,null,null,null,null,null,null,0,""]
[{"$f":"IF(RIGHT('Org structure'!D60,18)<>\"[Name of sub-vote]\",'Org structure'!D60,\"\")","v":""},null,null,null,null,null,null,null,0,""]
[{"$f":"IF(RIGHT('Org structure'!D61,18)<>\"[Name of sub-vote]\",'Org structure'!D61,\"\")","v":""},null,null,null,null,null,null,null,0,""]
[{"$f":"IF(RIGHT('Org structure'!D62,18)<>\"[Name of sub-vote]\",'Org structure'!D62,\"\")","v":""},null,null,null,null,null,null,null,0,""]
[{"$f":"IF(RIGHT('Org structure'!D63,18)<>\"[Name of sub-vote]\",'Org structure'!D63,\"\")","v":""},null,null,null,null,null,null,null,0,""]
[{"$f":"IF(RIGHT('Org structure'!D64,18)<>\"[Name of sub-vote]\",'Org structure'!D64,\"\")","v":""},null,null,null,null,null,null,null,0,""]
[{"$f":"IF(RIGHT('Org structure'!D65,18)<>\"[Name of sub-vote]\",'Org structure'!D65,\"\")","v":""},null,null,null,null,null,null,null,0,""]
[{"$f":"IF(RIGHT('Org structure'!D66,18)<>\"[Name of sub-vote]\",'Org structure'!D66,\"\")","v":""},null,null,null,null,null,null,null,{"$f":"G71-H71","v":0},{"$f":"IF(I71=0,\"\",I71/H71)","v":""}]
[{"$f":"IF(RIGHT('Org structure'!D67,18)<>\"[Name of sub-vote]\",'Org structure'!D67,\"\")","v":""},null,null,null,null,null,null,null,0,""]
[{"$f":"'Org structure'!A8","v":"Vote 7 - Road Transport"},null,{"$f":"SUM(C74:C83)","v":47267449},40002820,0,0,0,3333568.333333333,-3333568.333333333,-1,40002820]
[{"$f":"IF(RIGHT('Org structure'!D69,18)<>\"[Name of sub-vote]\",'Org structure'!D69,\"\")","v":"7.1 - Taxi Ranks"},null,null,null,null,null,null,{"$f":"1/12*D74","v":0},0,""]
[{"$f":"IF(RIGHT('Org structure'!D70,18)<>\"[Name of sub-vote]\",'Org structure'!D70,\"\")","v":"7.2 - Road and Traffic Regulation"},null,null,null,null,null,null,{"$f":"1/12*D75","v":0},0,""]
[{"$f":"IF(RIGHT('Org structure'!D71,18)<>\"[Name of sub-vote]\",'Org structure'!D71,\"\")","v":"7.3 - Public Transport"},null,null,null,null,null,null,{"$f":"1/12*D76","v":0},0,""]
[{"$f":"IF(RIGHT('Org structure'!D72,18)<>\"[Name of sub-vote]\",'Org structure'!D72,\"\")","v":"7.4 - Roads"},null,47267449,40002820,null,null,null,{"$f":"1/12*D77","v":3333568.333333333},-3333568.333333333,-1,40002820]
[{"$f":"IF(RIGHT('Org structure'!D73,18)<>\"[Name of sub-vote]\",'Org structure'!D73,\"\")","v":""},null,null,null,null,null,null,null,0,""]
[{"$f":"IF(RIGHT('Org structure'!D74,18)<>\"[Name of sub-vote]\",'Org structure'!D74,\"\")","v":""},null,null,null,null,null,null,null,0,""]
[{"$f":"IF(RIGHT('Org structure'!D75,18)<>\"[Name of sub-vote]\",'Org structure'!D75,\"\")","v":""},null,null,null,null,null,null,null,0,""]
[{"$f":"IF(RIGHT('Org structure'!D76,18)<>\"[Name of sub-vote]\",'Org structure'!D76,\"\")","v":""},null,null,null,null,null,null,null,0,""]
[{"$f":"IF(RIGHT('Org structure'!D77,18)<>\"[Name of sub-vote]\",'Org structure'!D77,\"\")","v":""},null,null,null,null,null,null,null,0,""]
[{"$f":"IF(RIGHT('Org structure'!D78,18)<>\"[Name of sub-vote]\",'Org structure'!D78,\"\")","v":""},null,null,null,null,null,null,null,0,""]
[{"$f":"'Org structure'!A9","v":"Vote 8 - Public Safety"},null,{"$f":"SUM(C85:C94)","v":0},{"$f":"SUM(D85:D94)","v":0},0,0,0,0,0,"",0]
[{"$f":"IF(RIGHT('Org structure'!D80,18)<>\"[Name of sub-vote]\",'Org structure'!D80,\"\")","v":"8.1 - Cleansing"},null,null,null,null,null,null,{"$f":"1/12*D85","v":0},0,""]
[{"$f":"IF(RIGHT('Org structure'!D81,18)<>\"[Name of sub-vote]\",'Org structure'!D81,\"\")","v":"8.2 - Fencing and Fences"},null,null,null,null,null,null,{"$f":"1/12*D86","v":0},0,""]
[{"$f":"IF(RIGHT('Org structure'!D82,18)<>\"[Name of sub-vote]\",'Org structure'!D82,\"\")","v":""},null,null,null,null,null,null,null,0,""]
[{"$f":"IF(RIGHT('Org structure'!D83,18)<>\"[Name of sub-vote]\",'Org structure'!D83,\"\")","v":""},null,null,null,null,null,null,null,0,""]
[{"$f":"IF(RIGHT('Org structure'!D84,18)<>\"[Name of sub-vote]\",'Org structure'!D84,\"\")","v":""},null,null,null,null,null,null,null,0,""]
[{"$f":"IF(RIGHT('Org structure'!D85,18)<>\"[Name of sub-vote]\",'Org structure'!D85,\"\")","v":""},null,null,null,null,null,null,null,0,""]
[{"$f":"IF(RIGHT('Org structure'!D86,18)<>\"[Name of sub-vote]\",'Org structure'!D86,\"\")","v":""},null,null,null,null,null,null,null,0,""]
[{"$f":"IF(RIGHT('Org structure'!D87,18)<>\"[Name of sub-vote]\",'Org structure'!D87,\"\")","v":""},null,null,null,null,null,null,null,0,""]
[{"$f":"IF(RIGHT('Org structure'!D88,18)<>\"[Name of sub-vote]\",'Org structure'!D88,\"\")","v":""},null,null,null,null,null,null,null,0,""]
[{"$f":"IF(RIGHT('Org structure'!D89,18)<>\"[Name of sub-vote]\",'Org structure'!D89,\"\")","v":""},null,null,null,null,null,null,null,0,""]
[{"$f":"'Org structure'!A10","v":"Vote 9 - Waste Management"},null,{"$f":"SUM(C96:C105)","v":0},{"$f":"SUM(D96:D105)","v":12500000},0,0,0,1041666.6666666666,-1041666.6666666666,-1,12500000,0,0,0,0,0,0,0,0,0,0,0,0]
[{"$f":"IF(RIGHT('Org structure'!D91,18)<>\"[Name of sub-vote]\",'Org structure'!D91,\"\")","v":"9.1 - Recycling"},null,null,null,null,null,null,{"$f":"1/12*D96","v":0},0,""]
[{"$f":"IF(RIGHT('Org structure'!D92,18)<>\"[Name of sub-vote]\",'Org structure'!D92,\"\")","v":"9.2 - Solid Waste Disposal (Landfill Sites)"},null,null,12500000,null,null,null,{"$f":"1/12*D97","v":1041666.6666666666},-1041666.6666666666,-1,12500000]
[{"$f":"IF(RIGHT('Org structure'!D93,18)<>\"[Name of sub-vote]\",'Org structure'!D93,\"\")","v":"9.3 - Solid Waste Removal"},null,null,null,null,null,null,{"$f":"1/12*D98","v":0},0,""]
[{"$f":"IF(RIGHT('Org structure'!D94,18)<>\"[Name of sub-vote]\",'Org structure'!D94,\"\")","v":""},null,null,null,null,null,null,null,0,""]
[{"$f":"IF(RIGHT('Org structure'!D95,18)<>\"[Name of sub-vote]\",'Org structure'!D95,\"\")","v":""},null,null,null,null,null,null,null,0,""]
[{"$f":"IF(RIGHT('Org structure'!D96,18)<>\"[Name of sub-vote]\",'Org structure'!D96,\"\")","v":""},null,null,null,null,null,null,null,0,""]
[{"$f":"IF(RIGHT('Org structure'!D97,18)<>\"[Name of sub-vote]\",'Org structure'!D97,\"\")","v":""},null,null,null,null,null,null,null,0,""]
[{"$f":"IF(RIGHT('Org structure'!D98,18)<>\"[Name of sub-vote]\",'Org structure'!D98,\"\")","v":""},null,null,null,null,null,null,null,0,""]
[{"$f":"IF(RIGHT('Org structure'!D99,18)<>\"[Name of sub-vote]\",'Org structure'!D99,\"\")","v":""},null,null,null,null,null,null,null,0,""]
[{"$f":"IF(RIGHT('Org structure'!D100,18)<>\"[Name of sub-vote]\",'Org structure'!D100,\"\")","v":""},null,null,null,null,null,null,null,0,""]
[{"$f":"'Org structure'!A11","v":"Vote 10 - Sports & Recreation"},null,{"$f":"SUM(C107:C116)","v":0},{"$f":"SUM(D107:D116)","v":23250780},0,0,0,1937564.9999999998,-1937564.9999999998,-1,23250780]
[{"$f":"IF(RIGHT('Org structure'!D102,18)<>\"[Name of sub-vote]\",'Org structure'!D102,\"\")","v":"10.1 - Recreational Facilities"},null,null,2500000,null,null,null,{"$f":"1/12*D107","v":208333.33333333331},-208333.33333333331,-1,2500000]
[{"$f":"IF(RIGHT('Org structure'!D103,18)<>\"[Name of sub-vote]\",'Org structure'!D103,\"\")","v":"10.2 - Sports Grounds and Stadiums"},null,null,20750780,null,null,null,{"$f":"1/12*D108","v":1729231.6666666665},-1729231.6666666665,-1,20750780]
[{"$f":"IF(RIGHT('Org structure'!D104,18)<>\"[Name of sub-vote]\",'Org structure'!D104,\"\")","v":""},null,null,null,null,null,null,null,0,""]
[{"$f":"IF(RIGHT('Org structure'!D105,18)<>\"[Name of sub-vote]\",'Org structure'!D105,\"\")","v":""},null,null,null,null,null,null,null,0,""]
[{"$f":"IF(RIGHT('Org structure'!D106,18)<>\"[Name of sub-vote]\",'Org structure'!D106,\"\")","v":""},null,null,null,null,null,null,null,0,""]
[{"$f":"IF(RIGHT('Org structure'!D107,18)<>\"[Name of sub-vote]\",'Org structure'!D107,\"\")","v":""},null,null,null,null,null,null,null,0,""]
[{"$f":"IF(RIGHT('Org structure'!D108,18)<>\"[Name of sub-vote]\",'Org structure'!D108,\"\")","v":""},null,null,null,null,null,null,null,0,""]
[{"$f":"IF(RIGHT('Org structure'!D109,18)<>\"[Name of sub-vote]\",'Org structure'!D109,\"\")","v":""},null,null,null,null,null,null,null,0,""]
[{"$f":"IF(RIGHT('Org structure'!D110,18)<>\"[Name of sub-vote]\",'Org structure'!D110,\"\")","v":""},null,null,null,null,null,null,null,0,""]
[{"$f":"IF(RIGHT('Org structure'!D111,18)<>\"[Name of sub-vote]\",'Org structure'!D111,\"\")","v":""},null,null,null,null,null,null,null,0,""]
[{"$f":"'Org structure'!A12","v":"Vote 11 - Water Management"},null,{"$f":"SUM(C118:C127)","v":0},{"$f":"SUM(D118:D127)","v":0},0,0,0,0,0,"",0]
[{"$f":"IF(RIGHT('Org structure'!D113,18)<>\"[Name of sub-vote]\",'Org structure'!D113,\"\")","v":"11.1 - Water Distribution"},null,null,null,null,null,null,{"$f":"1/12*D118","v":0},0,""]
[{"$f":"IF(RIGHT('Org structure'!D114,18)<>\"[Name of sub-vote]\",'Org structure'!D114,\"\")","v":""},null,null,null,null,null,null,null,0,""]
[{"$f":"IF(RIGHT('Org structure'!D115,18)<>\"[Name of sub-vote]\",'Org structure'!D115,\"\")","v":""},null,null,null,null,null,null,null,0,""]
[{"$f":"IF(RIGHT('Org structure'!D116,18)<>\"[Name of sub-vote]\",'Org structure'!D116,\"\")","v":""},null,null,null,null,null,null,null,0,""]
[{"$f":"IF(RIGHT('Org structure'!D117,18)<>\"[Name of sub-vote]\",'Org structure'!D117,\"\")","v":""},null,null,null,null,null,null,null,0,""]
[{"$f":"IF(RIGHT('Org structure'!D118,18)<>\"[Name of sub-vote]\",'Org structure'!D118,\"\")","v":""},null,null,null,null,null,null,null,0,""]
[{"$f":"IF(RIGHT('Org structure'!D119,18)<>\"[Name of sub-vote]\",'Org structure'!D119,\"\")","v":""},null,null,null,null,null,null,null,0,""]
[{"$f":"IF(RIGHT('Org structure'!D120,18)<>\"[Name of sub-vote]\",'Org structure'!D120,\"\")","v":""},null,null,null,null,null,null,null,0,""]
[{"$f":"IF(RIGHT('Org structure'!D121,18)<>\"[Name of sub-vote]\",'Org structure'!D121,\"\")","v":""},null,null,null,null,null,null,null,0,""]
[{"$f":"IF(RIGHT('Org structure'!D122,18)<>\"[Name of sub-vote]\",'Org structure'!D122,\"\")","v":""},null,null,null,null,null,null,null,0,""]
[{"$f":"'Org structure'!A13","v":"Vote 12 - Waste Water Management"},null,{"$f":"SUM(C129:C138)","v":0},{"$f":"SUM(D129:D138)","v":0},0,0,0,0,0,"",0]
[{"$f":"IF(RIGHT('Org structure'!D124,18)<>\"[Name of sub-vote]\",'Org structure'!D124,\"\")","v":"12.1 - Sewerage"},null,null,null,null,null,null,{"$f":"1/12*D129","v":0},0,""]
[{"$f":"IF(RIGHT('Org structure'!D125,18)<>\"[Name of sub-vote]\",'Org structure'!D125,\"\")","v":""},null,null,null,null,null,null,null,0,""]
[{"$f":"IF(RIGHT('Org structure'!D126,18)<>\"[Name of sub-vote]\",'Org structure'!D126,\"\")","v":""},null,null,null,null,null,null,null,0,""]
[{"$f":"IF(RIGHT('Org structure'!D127,18)<>\"[Name of sub-vote]\",'Org structure'!D127,\"\")","v":""},null,null,null,null,null,null,null,0,""]
[{"$f":"IF(RIGHT('Org structure'!D128,18)<>\"[Name of sub-vote]\",'Org structure'!D128,\"\")","v":""},null,null,null,null,null,null,null,0,""]
[{"$f":"IF(RIGHT('Org structure'!D129,18)<>\"[Name of sub-vote]\",'Org structure'!D129,\"\")","v":""},null,null,null,null,null,null,null,0,""]
[{"$f":"IF(RIGHT('Org structure'!D130,18)<>\"[Name of sub-vote]\",'Org structure'!D130,\"\")","v":""},null,null,null,null,null,null,null,{"$f":"G135-H135","v":0},{"$f":"IF(I135=0,\"\",I135/H135)","v":""}]
[{"$f":"IF(RIGHT('Org structure'!D131,18)<>\"[Name of sub-vote]\",'Org structure'!D131,\"\")","v":""},null,null,null,null,null,null,null,0,""]
[{"$f":"IF(RIGHT('Org structure'!D132,18)<>\"[Name of sub-vote]\",'Org structure'!D132,\"\")","v":""},null,null,null,null,null,null,null,0,""]
[{"$f":"IF(RIGHT('Org structure'!D133,18)<>\"[Name of sub-vote]\",'Org structure'!D133,\"\")","v":""},null,null,null,null,null,null,null,0,""]
[{"$f":"'Org structure'!A14","v":"Vote 13 - Housing"},null,{"$f":"SUM(C140:C149)","v":0},{"$f":"SUM(D140:D149)","v":0},0,0,0,0,0,"",0]
[{"$f":"IF(RIGHT('Org structure'!D135,18)<>\"[Name of sub-vote]\",'Org structure'!D135,\"\")","v":"13.1 - Housing"},null,null,null,null,null,null,{"$f":"1/12*D140","v":0},0,""]
[{"$f":"IF(RIGHT('Org structure'!D136,18)<>\"[Name of sub-vote]\",'Org structure'!D136,\"\")","v":""},null,null,null,null,null,null,null,0,""]
[{"$f":"IF(RIGHT('Org structure'!D137,18)<>\"[Name of sub-vote]\",'Org structure'!D137,\"\")","v":""},null,null,null,null,null,null,null,0,""]
[{"$f":"IF(RIGHT('Org structure'!D138,18)<>\"[Name of sub-vote]\",'Org structure'!D138,\"\")","v":""},null,null,null,null,null,null,null,0,""]
[{"$f":"IF(RIGHT('Org structure'!D139,18)<>\"[Name of sub-vote]\",'Org structure'!D139,\"\")","v":""},null,null,null,null,null,null,null,0,""]
[{"$f":"IF(RIGHT('Org structure'!D140,18)<>\"[Name of sub-vote]\",'Org structure'!D140,\"\")","v":""},null,null,null,null,null,null,null,0,""]
[{"$f":"IF(RIGHT('Org structure'!D141,18)<>\"[Name of sub-vote]\",'Org structure'!D141,\"\")","v":""},null,null,null,null,null,null,null,0,""]
[{"$f":"IF(RIGHT('Org structure'!D142,18)<>\"[Name of sub-vote]\",'Org structure'!D142,\"\")","v":""},null,null,null,null,null,null,null,0,""]
[{"$f":"IF(RIGHT('Org structure'!D143,18)<>\"[Name of sub-vote]\",'Org structure'!D143,\"\")","v":""},null,null,null,null,null,null,null,0,""]
[{"$f":"IF(RIGHT('Org structure'!D144,18)<>\"[Name of sub-vote]\",'Org structure'!D144,\"\")","v":""},null,null,null,null,null,null,null,0,""]
[{"$f":"'Org structure'!A15","v":"Vote 14 - Finance & Administration"},null,{"$f":"SUM(C151:C160)","v":0},{"$f":"SUM(D151:D160)","v":22450000},0,0,0,1870833.3333333333,-1870833.3333333333,-1,22450000]
[{"$f":"IF(RIGHT('Org structure'!D146,18)<>\"[Name of sub-vote]\",'Org structure'!D146,\"\")","v":"14.1 - Security Services"},null,null,null,null,null,null,{"$f":"1/12*D151","v":0},0,""]
[{"$f":"IF(RIGHT('Org structure'!D147,18)<>\"[Name of sub-vote]\",'Org structure'!D147,\"\")","v":"14.2 - Administrative and Corporate Support"},null,null,20050000,null,null,null,{"$f":"1/12*D152","v":1670833.3333333333},-1670833.3333333333,-1,20050000]
[{"$f":"IF(RIGHT('Org structure'!D148,18)<>\"[Name of sub-vote]\",'Org structure'!D148,\"\")","v":"14.3 - Information Technology"},null,null,2400000,null,null,null,{"$f":"1/12*D153","v":200000},-200000,-1,2400000]
[{"$f":"IF(RIGHT('Org structure'!D149,18)<>\"[Name of sub-vote]\",'Org structure'!D149,\"\")","v":""},null,null,null,null,null,null,null,0,""]
[{"$f":"IF(RIGHT('Org structure'!D150,18)<>\"[Name of sub-vote]\",'Org structure'!D150,\"\")","v":""},null,null,null,null,null,null,null,0,""]
[{"$f":"IF(RIGHT('Org structure'!D151,18)<>\"[Name of sub-vote]\",'Org structure'!D151,\"\")","v":""},null,null,null,null,null,null,null,0,""]
[{"$f":"IF(RIGHT('Org structure'!D152,18)<>\"[Name of sub-vote]\",'Org structure'!D152,\"\")","v":""},null,null,null,null,null,null,null,0,""]
[{"$f":"IF(RIGHT('Org structure'!D153,18)<>\"[Name of sub-vote]\",'Org structure'!D153,\"\")","v":""},null,null,null,null,null,null,null,0,""]
[{"$f":"IF(RIGHT('Org structure'!D154,18)<>\"[Name of sub-vote]\",'Org structure'!D154,\"\")","v":""},null,null,null,null,null,null,null,0,""]
[{"$f":"IF(RIGHT('Org structure'!D155,18)<>\"[Name of sub-vote]\",'Org structure'!D155,\"\")","v":""},null,null,null,null,null,null,null,0,""]
[{"$f":"'Org structure'!A16","v":"Vote 15 - [NAME OF VOTE 5]"},null,{"$f":"SUM(C162:C171)","v":0},{"$f":"SUM(D162:D171)","v":0},0,0,0,0,0,"",0]
[{"$f":"IF(RIGHT('Org structure'!D157,18)<>\"[Name of sub-vote]\",'Org structure'!D157,\"\")","v":""},null,null,null,null,null,null,null,0,""]
[{"$f":"IF(RIGHT('Org structure'!D158,18)<>\"[Name of sub-vote]\",'Org structure'!D158,\"\")","v":""},null,null,null,null,null,null,null,0,""]
[{"$f":"IF(RIGHT('Org structure'!D159,18)<>\"[Name of sub-vote]\",'Org structure'!D159,\"\")","v":""},null,null,null,null,null,null,null,0,""]
[{"$f":"IF(RIGHT('Org structure'!D160,18)<>\"[Name of sub-vote]\",'Org structure'!D160,\"\")","v":""},null,null,null,null,null,null,null,0,""]
[{"$f":"IF(RIGHT('Org structure'!D161,18)<>\"[Name of sub-vote]\",'Org structure'!D161,\"\")","v":""},null,null,null,null,null,null,null,0,""]
[{"$f":"IF(RIGHT('Org structure'!D162,18)<>\"[Name of sub-vote]\",'Org structure'!D162,\"\")","v":""},null,null,null,null,null,null,null,0,""]
[{"$f":"IF(RIGHT('Org structure'!D163,18)<>\"[Name of sub-vote]\",'Org structure'!D163,\"\")","v":""},null,null,null,null,null,null,null,0,""]
[{"$f":"IF(RIGHT('Org structure'!D164,18)<>\"[Name of sub-vote]\",'Org structure'!D164,\"\")","v":""},null,null,null,null,null,null,null,0,""]
[{"$f":"IF(RIGHT('Org structure'!D165,18)<>\"[Name of sub-vote]\",'Org structure'!D165,\"\")","v":""},null,null,null,null,null,null,null,0,""]
[{"$f":"IF(RIGHT('Org structure'!D166,18)<>\"[Name of sub-vote]\",'Org structure'!D166,\"\")","v":""},null,null,null,null,null,null,null,0,"",null,{"$f":"SUM(L79:L82)","v":0},0,0,0,0,0,0,0,0,0,0,0]
["Total multi-year capital expenditure",null,{"$f":"C7+C18+C29+C40+C51+C62+C73+C84+C95+C106+C117+C128+C139+C150+C161","v":59422813},{"$f":"D7+D18+D29+D40+D51+D62+D73+D84+D95+D106+D117+D128+D139+D150+D161","v":101370266},0,0,0,8447522.166666666,-8447522.166666666,-1,101370266]
[null,null,null,null,null,null,null,null,0,""]
["Capital expenditure - Municipal Vote"]
["Expenditue of single-year capital appropriation",1,null,null,null,null,null,null,0,""]
[{"$f":"'Org structure'!A2","v":"Vote 1 - Energy Sources"},null,{"$f":"SUM(C177:C186)","v":115814},300000,0,0,0,25000,-25000,-1,300000]
[{"$f":"IF(RIGHT('Org structure'!D3,18)<>\"[Name of sub-vote]\",'Org structure'!D3,\"\")","v":"1.1 - Electricity"},null,115814,300000,0,0,0,{"$f":"1/12*D177","v":25000},-25000,-1,300000]
[{"$f":"IF(RIGHT('Org structure'!D4,18)<>\"[Name of sub-vote]\",'Org structure'!D4,\"\")","v":"1.2 - Street Lighting and Signal Systems"},null,0,0,0,0,0,0,0,"",0]
[{"$f":"IF(RIGHT('Org structure'!D5,18)<>\"[Name of sub-vote]\",'Org structure'!D5,\"\")","v":""},null,0,0,0,0,0,0,0,"",0]
[{"$f":"IF(RIGHT('Org structure'!D6,18)<>\"[Name of sub-vote]\",'Org structure'!D6,\"\")","v":""},null,0,0,0,0,0,0,0,"",0]
[{"$f":"IF(RIGHT('Org structure'!D7,18)<>\"[Name of sub-vote]\",'Org structure'!D7,\"\")","v":""},null,0,0,0,0,0,0,0,"",0]
[{"$f":"IF(RIGHT('Org structure'!D8,18)<>\"[Name of sub-vote]\",'Org structure'!D8,\"\")","v":""},null,0,0,0,0,0,0,0,"",0]
[{"$f":"IF(RIGHT('Org structure'!D9,18)<>\"[Name of sub-vote]\",'Org structure'!D9,\"\")","v":""},null,0,0,0,0,0,0,0,"",0]
[{"$f":"IF(RIGHT('Org structure'!D10,18)<>\"[Name of sub-vote]\",'Org structure'!D10,\"\")","v":""},null,0,0,0,0,0,0,0,"",0]
[{"$f":"IF(RIGHT('Org structure'!D11,18)<>\"[Name of sub-vote]\",'Org structure'!D11,\"\")","v":""},null,0,0,0,0,0,0,0,"",0]
[{"$f":"IF(RIGHT('Org structure'!D12,18)<>\"[Name of sub-vote]\",'Org structure'!D12,\"\")","v":""},null,0,0,0,0,0,0,0,"",0]
[{"$f":"'Org structure'!A3","v":"Vote 2 - Community and Social Services"},null,{"$f":"SUM(C188:C197)","v":0},{"$f":"SUM(D188:D197)","v":0},{"$f":"SUM(E188:E197)","v":0},0,0,0,0,"",0]
[{"$f":"IF(RIGHT('Org structure'!D14,18)<>\"[Name of sub-vote]\",'Org structure'!D14,\"\")","v":"2.1 - Animal Care and Diseases"},null,0,0,0,0,0,{"$f":"1/12*D188","v":0},0,"",0]
[{"$f":"IF(RIGHT('Org structure'!D15,18)<>\"[Name of sub-vote]\",'Org structure'!D15,\"\")","v":"2.2 - Community Halls and Facilities"},null,0,0,0,0,0,{"$f":"1/12*D189","v":0},0,"",0]
[{"$f":"IF(RIGHT('Org structure'!D16,18)<>\"[Name of sub-vote]\",'Org structure'!D16,\"\")","v":"2.3 - Libraries and Archives"},null,0,0,0,0,0,{"$f":"1/12*D190","v":0},0,"",0]
[{"$f":"IF(RIGHT('Org structure'!D17,18)<>\"[Name of sub-vote]\",'Org structure'!D17,\"\")","v":"2.4 - Cemeteries, Funeral Parlours and Crematoriums"},null,0,0,0,0,0,{"$f":"1/12*D191","v":0},0,"",0]
[{"$f":"IF(RIGHT('Org structure'!D18,18)<>\"[Name of sub-vote]\",'Org structure'!D18,\"\")","v":"2.5 - Disaster Management"},null,0,0,0,0,0,{"$f":"1/12*D192","v":0},0,"",0]
[{"$f":"IF(RIGHT('Org structure'!D19,18)<>\"[Name of sub-vote]\",'Org structure'!D19,\"\")","v":""},null,0,0,0,0,0,0,0,"",0]
[{"$f":"IF(RIGHT('Org structure'!D20,18)<>\"[Name of sub-vote]\",'Org structure'!D20,\"\")","v":""},null,0,0,0,0,0,0,0,"",0]
[{"$f":"IF(RIGHT('Org structure'!D21,18)<>\"[Name of sub-vote]\",'Org structure'!D21,\"\")","v":""},null,0,0,0,0,0,0,0,"",0]
[{"$f":"IF(RIGHT('Org structure'!D22,18)<>\"[Name of sub-vote]\",'Org structure'!D22,\"\")","v":""},null,0,0,0,0,0,0,0,"",0]
[{"$f":"IF(RIGHT('Org structure'!D23,18)<>\"[Name of sub-vote]\",'Org structure'!D23,\"\")","v":""},null,0,0,0,0,0,0,0,"",0]
[{"$f":"'Org structure'!A4","v":"Vote 3 - Finance & Administration"},null,{"$f":"SUM(C199:C208)","v":2417221},2500000,0,0,0,208333.33333333331,-208333.33333333331,-1,2500000]
[{"$f":"IF(RIGHT('Org structure'!D25,18)<>\"[Name of sub-vote]\",'Org structure'!D25,\"\")","v":"3.1 - Fleet Management"},null,2417221,2500000,0,0,0,{"$f":"1/12*D199","v":208333.33333333331},-208333.33333333331,-1,2500000]
[{"$f":"IF(RIGHT('Org structure'!D26,18)<>\"[Name of sub-vote]\",'Org structure'!D26,\"\")","v":"3.2 - Finance"},null,0,0,0,0,0,0,{"$f":"G200-H200","v":0},{"$f":"IF(I200=0,\"\",I200/H200)","v":""},0]
[{"$f":"IF(RIGHT('Org structure'!D27,18)<>\"[Name of sub-vote]\",'Org structure'!D27,\"\")","v":"3.3 - Asset Management"},null,0,0,0,0,0,0,0,"",0]
[{"$f":"IF(RIGHT('Org structure'!D28,18)<>\"[Name of sub-vote]\",'Org structure'!D28,\"\")","v":"3.4 - Human Resources"},null,0,0,0,0,0,0,0,"",0]
[{"$f":"IF(RIGHT('Org structure'!D29,18)<>\"[Name of sub-vote]\",'Org structure'!D29,\"\")","v":"3.5 - Legal Services"},null,0,0,0,0,0,0,0,"",0]
[{"$f":"IF(RIGHT('Org structure'!D30,18)<>\"[Name of sub-vote]\",'Org structure'!D30,\"\")","v":"3.6 - Property Services"},null,0,0,0,0,0,0,0,"",0]
[{"$f":"IF(RIGHT('Org structure'!D31,18)<>\"[Name of sub-vote]\",'Org structure'!D31,\"\")","v":"3.7 - Risk Management"},null,0,0,0,0,0,0,0,"",0]
[{"$f":"IF(RIGHT('Org structure'!D32,18)<>\"[Name of sub-vote]\",'Org structure'!D32,\"\")","v":"3.8 - Supply Chain Management"},null,0,0,0,0,0,0,0,"",0]
[{"$f":"IF(RIGHT('Org structure'!D33,18)<>\"[Name of sub-vote]\",'Org structure'!D33,\"\")","v":""},null,0,0,0,0,0,0,0,"",0]
[{"$f":"IF(RIGHT('Org structure'!D34,18)<>\"[Name of sub-vote]\",'Org structure'!D34,\"\")","v":""},null,0,0,0,0,0,0,0,"",0]
[{"$f":"'Org structure'!A5","v":"Vote 4 - Planning and Development"},null,{"$f":"SUM(C210:C219)","v":0},0,0,0,0,0,0,0,0,0,0,0,0,0,0,0,0,0,0,0,0]
[{"$f":"IF(RIGHT('Org structure'!D36,18)<>\"[Name of sub-vote]\",'Org structure'!D36,\"\")","v":"4.1 - Town Planning, Building Regulations and Enforcement, and City Engineer"},null,0,0,0,0,0,{"$f":"1/12*D210","v":0},0,"",0]
[{"$f":"IF(RIGHT('Org structure'!D37,18)<>\"[Name of sub-vote]\",'Org structure'!D37,\"\")","v":"4.2 - Corporate Wide Strategic Planning (IDPs, LEDs)"},null,0,0,0,0,0,{"$f":"1/12*D211","v":0},0,"",0]
[{"$f":"IF(RIGHT('Org structure'!D38,18)<>\"[Name of sub-vote]\",'Org structure'!D38,\"\")","v":"4.3 - Economic Development/Planning"},null,0,0,0,0,0,{"$f":"1/12*D212","v":0},0,"",0]
[{"$f":"IF(RIGHT('Org structure'!D39,18)<>\"[Name of sub-vote]\",'Org structure'!D39,\"\")","v":"4.4 - Project Management Unit"},null,0,0,0,0,0,{"$f":"1/12*D213","v":0},0,"",0]
[{"$f":"IF(RIGHT('Org structure'!D40,18)<>\"[Name of sub-vote]\",'Org structure'!D40,\"\")","v":""},null,0,0,0,0,0,0,0,"",0]
[{"$f":"IF(RIGHT('Org structure'!D41,18)<>\"[Name of sub-vote]\",'Org structure'!D41,\"\")","v":""},null,0,0,0,0,0,0,0,"",0]
[{"$f":"IF(RIGHT('Org structure'!D42,18)<>\"[Name of sub-vote]\",'Org structure'!D42,\"\")","v":""},null,0,0,0,0,0,0,0,"",0]
[{"$f":"IF(RIGHT('Org structure'!D43,18)<>\"[Name of sub-vote]\",'Org structure'!D43,\"\")","v":""},null,0,0,0,0,0,0,0,"",0]
[{"$f":"IF(RIGHT('Org structure'!D44,18)<>\"[Name of sub-vote]\",'Org structure'!D44,\"\")","v":""},null,0,0,0,0,0,0,0,"",0]
[{"$f":"IF(RIGHT('Org structure'!D45,18)<>\"[Name of sub-vote]\",'Org structure'!D45,\"\")","v":""},null,0,0,0,0,0,0,0,"",0]
[{"$f":"'Org structure'!A6","v":"Vote 5 - Executive & Council"},null,{"$f":"SUM(C221:C230)","v":0},0,0,0,0,0,0,"",0]
[{"$f":"IF(RIGHT('Org structure'!D47,18)<>\"[Name of sub-vote]\",'Org structure'!D47,\"\")","v":"5.1 - Municipal Manager, Town Secretary and Chief Executive"},null,0,0,0,0,0,0,0,"",0]
[{"$f":"IF(RIGHT('Org structure'!D48,18)<>\"[Name of sub-vote]\",'Org structure'!D48,\"\")","v":"5.2 - Mayor and Council"},null,0,0,0,0,0,0,0,"",0]
[{"$f":"IF(RIGHT('Org structure'!D49,18)<>\"[Name of sub-vote]\",'Org structure'!D49,\"\")","v":""},null,0,0,0,0,0,0,0,"",0]
[{"$f":"IF(RIGHT('Org structure'!D50,18)<>\"[Name of sub-vote]\",'Org structure'!D50,\"\")","v":""},null,0,0,0,0,0,0,0,"",0]
[{"$f":"IF(RIGHT('Org structure'!D51,18)<>\"[Name of sub-vote]\",'Org structure'!D51,\"\")","v":""},null,0,0,0,0,0,0,0,"",0]
[{"$f":"IF(RIGHT('Org structure'!D52,18)<>\"[Name of sub-vote]\",'Org structure'!D52,\"\")","v":""},null,0,0,0,0,0,0,0,"",0]
[{"$f":"IF(RIGHT('Org structure'!D53,18)<>\"[Name of sub-vote]\",'Org structure'!D53,\"\")","v":""},null,0,0,0,0,0,0,0,"",0]
[{"$f":"IF(RIGHT('Org structure'!D54,18)<>\"[Name of sub-vote]\",'Org structure'!D54,\"\")","v":""},null,0,0,0,0,0,0,0,"",0]
[{"$f":"IF(RIGHT('Org structure'!D55,18)<>\"[Name of sub-vote]\",'Org structure'!D55,\"\")","v":""},null,0,0,0,0,0,0,0,"",0]
[{"$f":"IF(RIGHT('Org structure'!D56,18)<>\"[Name of sub-vote]\",'Org structure'!D56,\"\")","v":""},null,0,0,0,0,0,0,0,"",0]
[{"$f":"'Org structure'!A7","v":"Vote 6 - Internal Audit"},null,{"$f":"SUM(C232:C241)","v":0},0,0,0,0,0,0,"",0]
[{"$f":"IF(RIGHT('Org structure'!D58,18)<>\"[Name of sub-vote]\",'Org structure'!D58,\"\")","v":"6.1 - Governance Function"},null,0,0,0,0,0,0,0,"",0]
[{"$f":"IF(RIGHT('Org structure'!D59,18)<>\"[Name of sub-vote]\",'Org structure'!D59,\"\")","v":""},null,0,0,0,0,0,0,0,"",0]
[{"$f":"IF(RIGHT('Org structure'!D60,18)<>\"[Name of sub-vote]\",'Org structure'!D60,\"\")","v":""},null,0,0,0,0,0,0,0,"",0]
[{"$f":"IF(RIGHT('Org structure'!D61,18)<>\"[Name of sub-vote]\",'Org structure'!D61,\"\")","v":""},null,0,0,0,0,0,0,0,"",0]
[{"$f":"IF(RIGHT('Org structure'!D62,18)<>\"[Name of sub-vote]\",'Org structure'!D62,\"\")","v":""},null,0,0,0,0,0,0,0,"",0]
[{"$f":"IF(RIGHT('Org structure'!D63,18)<>\"[Name of sub-vote]\",'Org structure'!D63,\"\")","v":""},null,0,0,0,0,0,0,0,"",0]
[{"$f":"IF(RIGHT('Org structure'!D64,18)<>\"[Name of sub-vote]\",'Org structure'!D64,\"\")","v":""},null,0,0,0,0,0,0,0,"",0]
[{"$f":"IF(RIGHT('Org structure'!D65,18)<>\"[Name of sub-vote]\",'Org structure'!D65,\"\")","v":""},null,0,0,0,0,0,0,0,"",0]
[{"$f":"IF(RIGHT('Org structure'!D66,18)<>\"[Name of sub-vote]\",'Org structure'!D66,\"\")","v":""},null,0,0,0,0,0,0,0,"",0]
[{"$f":"IF(RIGHT('Org structure'!D67,18)<>\"[Name of sub-vote]\",'Org structure'!D67,\"\")","v":""},null,0,0,0,0,0,0,0,"",0]
[{"$f":"'Org structure'!A8","v":"Vote 7 - Road Transport"},null,{"$f":"SUM(C243:C252)","v":0},600000,0,0,0,50000,-50000,-1,600000]
[{"$f":"IF(RIGHT('Org structure'!D69,18)<>\"[Name of sub-vote]\",'Org structure'!D69,\"\")","v":"7.1 - Taxi Ranks"},null,0,0,0,0,0,{"$f":"1/12*D243","v":0},0,"",0]
[{"$f":"IF(RIGHT('Org structure'!D70,18)<>\"[Name of sub-vote]\",'Org structure'!D70,\"\")","v":"7.2 - Road and Traffic Regulation"},null,0,600000,0,0,0,{"$f":"1/12*D244","v":50000},-50000,-1,600000]
[{"$f":"IF(RIGHT('Org structure'!D71,18)<>\"[Name of sub-vote]\",'Org structure'!D71,\"\")","v":"7.3 - Public Transport"},null,0,0,0,0,0,{"$f":"1/12*D245","v":0},0,"",0]
[{"$f":"IF(RIGHT('Org structure'!D72,18)<>\"[Name of sub-vote]\",'Org structure'!D72,\"\")","v":"7.4 - Roads"},null,0,0,0,0,0,{"$f":"1/12*D246","v":0},0,"",0]
[{"$f":"IF(RIGHT('Org structure'!D73,18)<>\"[Name of sub-vote]\",'Org structure'!D73,\"\")","v":""},null,0,0,0,0,0,0,0,"",0]
[{"$f":"IF(RIGHT('Org structure'!D74,18)<>\"[Name of sub-vote]\",'Org structure'!D74,\"\")","v":""},null,0,0,0,0,0,0,0,"",0]
[{"$f":"IF(RIGHT('Org structure'!D75,18)<>\"[Name of sub-vote]\",'Org structure'!D75,\"\")","v":""},null,0,0,0,0,0,0,0,"",0]
[{"$f":"IF(RIGHT('Org structure'!D76,18)<>\"[Name of sub-vote]\",'Org structure'!D76,\"\")","v":""},null,0,0,0,0,0,0,0,"",0]
[{"$f":"IF(RIGHT('Org structure'!D77,18)<>\"[Name of sub-vote]\",'Org structure'!D77,\"\")","v":""},null,0,0,0,0,0,0,0,"",0]
[{"$f":"IF(RIGHT('Org structure'!D78,18)<>\"[Name of sub-vote]\",'Org structure'!D78,\"\")","v":""},null,0,0,0,0,0,0,0,"",0]
[{"$f":"'Org structure'!A9","v":"Vote 8 - Public Safety"},null,{"$f":"SUM(C254:C263)","v":0},0,0,0,0,0,0,"",0]
[{"$f":"IF(RIGHT('Org structure'!D80,18)<>\"[Name of sub-vote]\",'Org structure'!D80,\"\")","v":"8.1 - Cleansing"},null,0,0,0,0,0,{"$f":"1/12*D254","v":0},0,"",0]
[{"$f":"IF(RIGHT('Org structure'!D81,18)<>\"[Name of sub-vote]\",'Org structure'!D81,\"\")","v":"8.2 - Fencing and Fences"},null,0,0,0,0,0,{"$f":"1/12*D255","v":0},0,"",0]
[{"$f":"IF(RIGHT('Org structure'!D82,18)<>\"[Name of sub-vote]\",'Org structure'!D82,\"\")","v":""},null,0,0,0,0,0,0,0,"",0]
[{"$f":"IF(RIGHT('Org structure'!D83,18)<>\"[Name of sub-vote]\",'Org structure'!D83,\"\")","v":""},null,0,0,0,0,0,0,0,"",0]
[{"$f":"IF(RIGHT('Org structure'!D84,18)<>\"[Name of sub-vote]\",'Org structure'!D84,\"\")","v":""},null,0,0,0,0,0,0,0,"",0]
[{"$f":"IF(RIGHT('Org structure'!D85,18)<>\"[Name of sub-vote]\",'Org structure'!D85,\"\")","v":""},null,0,0,0,0,0,0,0,"",0]
[{"$f":"IF(RIGHT('Org structure'!D86,18)<>\"[Name of sub-vote]\",'Org structure'!D86,\"\")","v":""},null,0,0,0,0,0,0,0,"",0]
[{"$f":"IF(RIGHT('Org structure'!D87,18)<>\"[Name of sub-vote]\",'Org structure'!D87,\"\")","v":""},null,0,0,0,0,0,0,0,"",0]
[{"$f":"IF(RIGHT('Org structure'!D88,18)<>\"[Name of sub-vote]\",'Org structure'!D88,\"\")","v":""},null,0,0,0,0,0,0,0,"",0]
[{"$f":"IF(RIGHT('Org structure'!D89,18)<>\"[Name of sub-vote]\",'Org structure'!D89,\"\")","v":""},null,0,0,0,0,0,0,0,"",0]
[{"$f":"'Org structure'!A10","v":"Vote 9 - Waste Management"},null,{"$f":"SUM(C265:C274)","v":0},100000,0,0,0,8333.3333333333321,{"$f":"G264-H264","v":-8333.3333333333321},{"$f":"IF(I264=0,\"\",I264/H264)","v":-1},100000]
[{"$f":"IF(RIGHT('Org structure'!D91,18)<>\"[Name of sub-vote]\",'Org structure'!D91,\"\")","v":"9.1 - Recycling"},null,0,0,0,0,0,{"$f":"1/12*D265","v":0},0,"",0]
[{"$f":"IF(RIGHT('Org structure'!D92,18)<>\"[Name of sub-vote]\",'Org structure'!D92,\"\")","v":"9.2 - Solid Waste Disposal (Landfill Sites)"},null,0,0,0,0,0,{"$f":"1/12*D266","v":0},0,"",0]
[{"$f":"IF(RIGHT('Org structure'!D93,18)<>\"[Name of sub-vote]\",'Org structure'!D93,\"\")","v":"9.3 - Solid Waste Removal"},null,0,100000,0,0,0,{"$f":"1/12*D267","v":8333.3333333333321},-8333.3333333333321,-1,100000]
[{"$f":"IF(RIGHT('Org structure'!D94,18)<>\"[Name of sub-vote]\",'Org structure'!D94,\"\")","v":""},null,0,0,0,0,0,0,0,"",0]
[{"$f":"IF(RIGHT('Org structure'!D95,18)<>\"[Name of sub-vote]\",'Org structure'!D95,\"\")","v":""},null,0,0,0,0,0,0,0,"",0]
[{"$f":"IF(RIGHT('Org structure'!D96,18)<>\"[Name of sub-vote]\",'Org structure'!D96,\"\")","v":""},null,0,0,0,0,0,0,0,"",0]
[{"$f":"IF(RIGHT('Org structure'!D97,18)<>\"[Name of sub-vote]\",'Org structure'!D97,\"\")","v":""},null,0,0,0,0,0,0,0,"",0]
[{"$f":"IF(RIGHT('Org structure'!D98,18)<>\"[Name of sub-vote]\",'Org structure'!D98,\"\")","v":""},null,0,0,0,0,0,0,0,"",0]
[{"$f":"IF(RIGHT('Org structure'!D99,18)<>\"[Name of sub-vote]\",'Org structure'!D99,\"\")","v":""},null,0,0,0,0,0,0,0,"",0]
[{"$f":"IF(RIGHT('Org structure'!D100,18)<>\"[Name of sub-vote]\",'Org structure'!D100,\"\")","v":""},null,0,0,0,0,0,0,0,"",0]
[{"$f":"'Org structure'!A11","v":"Vote 10 - Sports & Recreation"},null,{"$f":"SUM(C276:C285)","v":0},0,0,0,0,0,0,"",0]
[{"$f":"IF(RIGHT('Org structure'!D102,18)<>\"[Name of sub-vote]\",'Org structure'!D102,\"\")","v":"10.1 - Recreational Facilities"},null,0,0,0,0,0,{"$f":"1/12*D276","v":0},0,"",0]
[{"$f":"IF(RIGHT('Org structure'!D103,18)<>\"[Name of sub-vote]\",'Org structure'!D103,\"\")","v":"10.2 - Sports Grounds and Stadiums"},null,0,0,0,0,0,0,0,"",0]
[{"$f":"IF(RIGHT('Org structure'!D104,18)<>\"[Name of sub-vote]\",'Org structure'!D104,\"\")","v":""},null,0,0,0,0,0,0,0,"",0]
[{"$f":"IF(RIGHT('Org structure'!D105,18)<>\"[Name of sub-vote]\",'Org structure'!D105,\"\")","v":""},null,0,0,0,0,0,0,0,"",0]
[{"$f":"IF(RIGHT('Org structure'!D106,18)<>\"[Name of sub-vote]\",'Org structure'!D106,\"\")","v":""},null,0,0,0,0,0,0,0,"",0]
[{"$f":"IF(RIGHT('Org structure'!D107,18)<>\"[Name of sub-vote]\",'Org structure'!D107,\"\")","v":""},null,0,0,0,0,0,0,0,"",0]
[{"$f":"IF(RIGHT('Org structure'!D108,18)<>\"[Name of sub-vote]\",'Org structure'!D108,\"\")","v":""},null,0,0,0,0,0,0,0,"",0]
[{"$f":"IF(RIGHT('Org structure'!D109,18)<>\"[Name of sub-vote]\",'Org structure'!D109,\"\")","v":""},null,0,0,0,0,0,0,0,"",0]
[{"$f":"IF(RIGHT('Org structure'!D110,18)<>\"[Name of sub-vote]\",'Org structure'!D110,\"\")","v":""},null,0,0,0,0,0,0,0,"",0]
[{"$f":"IF(RIGHT('Org structure'!D111,18)<>\"[Name of sub-vote]\",'Org structure'!D111,\"\")","v":""},null,0,0,0,0,0,0,0,"",0]
[{"$f":"'Org structure'!A12","v":"Vote 11 - Water Management"},null,{"$f":"SUM(C287:C296)","v":0},0,0,0,0,0,0,"",0]
[{"$f":"IF(RIGHT('Org structure'!D113,18)<>\"[Name of sub-vote]\",'Org structure'!D113,\"\")","v":"11.1 - Water Distribution"},null,0,0,0,0,0,0,0,"",0]
[{"$f":"IF(RIGHT('Org structure'!D114,18)<>\"[Name of sub-vote]\",'Org structure'!D114,\"\")","v":""},null,0,0,0,0,0,0,0,"",0]
[{"$f":"IF(RIGHT('Org structure'!D115,18)<>\"[Name of sub-vote]\",'Org structure'!D115,\"\")","v":""},null,0,0,0,0,0,0,0,"",0]
[{"$f":"IF(RIGHT('Org structure'!D116,18)<>\"[Name of sub-vote]\",'Org structure'!D116,\"\")","v":""},null,0,0,0,0,0,0,0,"",0]
[{"$f":"IF(RIGHT('Org structure'!D117,18)<>\"[Name of sub-vote]\",'Org structure'!D117,\"\")","v":""},null,0,0,0,0,0,0,0,"",0]
[{"$f":"IF(RIGHT('Org structure'!D118,18)<>\"[Name of sub-vote]\",'Org structure'!D118,\"\")","v":""},null,0,0,0,0,0,0,0,"",0]
[{"$f":"IF(RIGHT('Org structure'!D119,18)<>\"[Name of sub-vote]\",'Org structure'!D119,\"\")","v":""},null,0,0,0,0,0,0,0,"",0]
[{"$f":"IF(RIGHT('Org structure'!D120,18)<>\"[Name of sub-vote]\",'Org structure'!D120,\"\")","v":""},null,0,0,0,0,0,0,0,"",0]
[{"$f":"IF(RIGHT('Org structure'!D121,18)<>\"[Name of sub-vote]\",'Org structure'!D121,\"\")","v":""},null,0,0,0,0,0,0,0,"",0]
[{"$f":"IF(RIGHT('Org structure'!D122,18)<>\"[Name of sub-vote]\",'Org structure'!D122,\"\")","v":""},null,0,0,0,0,0,0,0,"",0]
[{"$f":"'Org structure'!A13","v":"Vote 12 - Waste Water Management"},null,{"$f":"SUM(C298:C307)","v":0},0,0,0,0,0,0,"",0]
[{"$f":"IF(RIGHT('Org structure'!D124,18)<>\"[Name of sub-vote]\",'Org structure'!D124,\"\")","v":"12.1 - Sewerage"},null,0,0,0,0,0,0,0,"",0]
[{"$f":"IF(RIGHT('Org structure'!D125,18)<>\"[Name of sub-vote]\",'Org structure'!D125,\"\")","v":""},null,0,0,0,0,0,0,0,"",0]
[{"$f":"IF(RIGHT('Org structure'!D126,18)<>\"[Name of sub-vote]\",'Org structure'!D126,\"\")","v":""},null,0,0,0,0,0,0,0,"",0]
[{"$f":"IF(RIGHT('Org structure'!D127,18)<>\"[Name of sub-vote]\",'Org structure'!D127,\"\")","v":""},null,0,0,0,0,0,0,0,"",0]
[{"$f":"IF(RIGHT('Org structure'!D128,18)<>\"[Name of sub-vote]\",'Org structure'!D128,\"\")","v":""},null,0,0,0,0,0,0,0,"",0]
[{"$f":"IF(RIGHT('Org structure'!D129,18)<>\"[Name of sub-vote]\",'Org structure'!D129,\"\")","v":""},null,0,0,0,0,0,0,0,"",0]
[{"$f":"IF(RIGHT('Org structure'!D130,18)<>\"[Name of sub-vote]\",'Org structure'!D130,\"\")","v":""},null,0,0,0,0,0,0,0,"",0]
[{"$f":"IF(RIGHT('Org structure'!D131,18)<>\"[Name of sub-vote]\",'Org structure'!D131,\"\")","v":""},null,0,0,0,0,0,0,0,"",0]
[{"$f":"IF(RIGHT('Org structure'!D132,18)<>\"[Name of sub-vote]\",'Org structure'!D132,\"\")","v":""},null,0,0,0,0,0,0,0,"",0]
[{"$f":"IF(RIGHT('Org structure'!D133,18)<>\"[Name of sub-vote]\",'Org structure'!D133,\"\")","v":""},null,0,0,0,0,0,0,0,"",0]
[{"$f":"'Org structure'!A14","v":"Vote 13 - Housing"},null,{"$f":"SUM(C309:C318)","v":0},0,0,0,0,0,0,"",0]
[{"$f":"IF(RIGHT('Org structure'!D135,18)<>\"[Name of sub-vote]\",'Org structure'!D135,\"\")","v":"13.1 - Housing"},null,0,0,0,0,0,0,0,"",0]
[{"$f":"IF(RIGHT('Org structure'!D136,18)<>\"[Name of sub-vote]\",'Org structure'!D136,\"\")","v":""},null,0,0,0,0,0,0,0,"",0]
[{"$f":"IF(RIGHT('Org structure'!D137,18)<>\"[Name of sub-vote]\",'Org structure'!D137,\"\")","v":""},null,0,0,0,0,0,0,0,"",0]
[{"$f":"IF(RIGHT('Org structure'!D138,18)<>\"[Name of sub-vote]\",'Org structure'!D138,\"\")","v":""},null,0,0,0,0,0,0,0,"",0]
[{"$f":"IF(RIGHT('Org structure'!D139,18)<>\"[Name of sub-vote]\",'Org structure'!D139,\"\")","v":""},null,0,0,0,0,0,0,0,"",0]
[{"$f":"IF(RIGHT('Org structure'!D140,18)<>\"[Name of sub-vote]\",'Org structure'!D140,\"\")","v":""},null,0,0,0,0,0,0,0,"",0]
[{"$f":"IF(RIGHT('Org structure'!D141,18)<>\"[Name of sub-vote]\",'Org structure'!D141,\"\")","v":""},null,0,0,0,0,0,0,0,"",0]
[{"$f":"IF(RIGHT('Org structure'!D142,18)<>\"[Name of sub-vote]\",'Org structure'!D142,\"\")","v":""},null,0,0,0,0,0,0,0,"",0]
[{"$f":"IF(RIGHT('Org structure'!D143,18)<>\"[Name of sub-vote]\",'Org structure'!D143,\"\")","v":""},null,0,0,0,0,0,0,0,"",0]
[{"$f":"IF(RIGHT('Org structure'!D144,18)<>\"[Name of sub-vote]\",'Org structure'!D144,\"\")","v":""},null,0,0,0,0,0,0,0,"",0]
[{"$f":"'Org structure'!A15","v":"Vote 14 - Finance & Administration"},null,{"$f":"SUM(C320:C329)","v":2508263},5000000,0,0,0,416666.66666666663,-416666.66666666663,-1,5000000]
[{"$f":"IF(RIGHT('Org structure'!D146,18)<>\"[Name of sub-vote]\",'Org structure'!D146,\"\")","v":"14.1 - Security Services"},null,0,2500000,0,0,0,{"$f":"1/12*D320","v":208333.33333333331},-208333.33333333331,-1,2500000]
[{"$f":"IF(RIGHT('Org structure'!D147,18)<>\"[Name of sub-vote]\",'Org structure'!D147,\"\")","v":"14.2 - Administrative and Corporate Support"},null,47398,1000000,0,0,0,83333.333333333328,-83333.333333333328,-1,1000000]
[{"$f":"IF(RIGHT('Org structure'!D148,18)<>\"[Name of sub-vote]\",'Org structure'!D148,\"\")","v":"14.3 - Information Technology"},null,2460865,1500000,0,0,0,125000,-125000,-1,1500000]
[{"$f":"IF(RIGHT('Org structure'!D149,18)<>\"[Name of sub-vote]\",'Org structure'!D149,\"\")","v":""},null,0,0,0,0,0,0,0,"",0]
[{"$f":"IF(RIGHT('Org structure'!D150,18)<>\"[Name of sub-vote]\",'Org structure'!D150,\"\")","v":""},null,0,0,0,0,0,0,0,"",0]
[{"$f":"IF(RIGHT('Org structure'!D151,18)<>\"[Name of sub-vote]\",'Org structure'!D151,\"\")","v":""},null,0,0,0,0,0,0,0,"",0]
[{"$f":"IF(RIGHT('Org structure'!D152,18)<>\"[Name of sub-vote]\",'Org structure'!D152,\"\")","v":""},null,0,0,0,0,0,0,0,"",0]
[{"$f":"IF(RIGHT('Org structure'!D153,18)<>\"[Name of sub-vote]\",'Org structure'!D153,\"\")","v":""},null,0,0,0,0,0,0,0,"",0]
[{"$f":"IF(RIGHT('Org structure'!D154,18)<>\"[Name of sub-vote]\",'Org structure'!D154,\"\")","v":""},null,0,0,0,0,0,0,{"$f":"G328-H328","v":0},{"$f":"IF(I328=0,\"\",I328/H328)","v":""},0]
[{"$f":"IF(RIGHT('Org structure'!D155,18)<>\"[Name of sub-vote]\",'Org structure'!D155,\"\")","v":""},null,0,0,0,0,0,0,0,"",0]
[{"$f":"'Org structure'!A16","v":"Vote 15 - [NAME OF VOTE 5]"},null,{"$f":"SUM(C331:C340)","v":0},0,0,0,0,0,0,"",0]
[{"$f":"IF(RIGHT('Org structure'!D157,18)<>\"[Name of sub-vote]\",'Org structure'!D157,\"\")","v":""},null,0,0,0,0,0,0,0,"",0]
[{"$f":"IF(RIGHT('Org structure'!D158,18)<>\"[Name of sub-vote]\",'Org structure'!D158,\"\")","v":""},null,0,0,0,0,0,0,0,"",0]
[{"$f":"IF(RIGHT('Org structure'!D159,18)<>\"[Name of sub-vote]\",'Org structure'!D159,\"\")","v":""},null,0,0,0,0,0,0,0,"",0]
[{"$f":"IF(RIGHT('Org structure'!D160,18)<>\"[Name of sub-vote]\",'Org structure'!D160,\"\")","v":""},null,0,0,0,0,0,0,0,"",0]
[{"$f":"IF(RIGHT('Org structure'!D161,18)<>\"[Name of sub-vote]\",'Org structure'!D161,\"\")","v":""},null,0,0,0,0,0,0,0,"",0]
[{"$f":"IF(RIGHT('Org structure'!D162,18)<>\"[Name of sub-vote]\",'Org structure'!D162,\"\")","v":""},null,0,0,0,0,0,0,0,"",0]
[{"$f":"IF(RIGHT('Org structure'!D163,18)<>\"[Name of sub-vote]\",'Org structure'!D163,\"\")","v":""},null,0,0,0,0,0,0,0,"",0]
[{"$f":"IF(RIGHT('Org structure'!D164,18)<>\"[Name of sub-vote]\",'Org structure'!D164,\"\")","v":""},null,0,0,0,0,0,0,0,"",0]
[{"$f":"IF(RIGHT('Org structure'!D165,18)<>\"[Name of sub-vote]\",'Org structure'!D165,\"\")","v":""},null,0,0,0,0,0,0,0,"",0]
[{"$f":"IF(RIGHT('Org structure'!D166,18)<>\"[Name of sub-vote]\",'Org structure'!D166,\"\")","v":""},null,0,0,0,0,0,0,0,"",0,{"$f":"SUM(L175:L251)","v":0},0,0,0,0,0,0,0,0,0,0,0]
["Total single-year capital expenditure",null,{"$f":"C176+C187+C198+C209+C220+C231+C242+C253+C264+C286+C297+C308+C319+C330+C275","v":5041298},{"$f":"D176+D187+D198+D209+D220+D231+D242+D253+D264+D286+D297+D308+D319+D330+D275","v":8500000},0,0,0,708333.33333333326,-708333.33333333326,-1,8500000]
[null,null,null,null,null,null,null,null,0,"",null,{"$f":"L171-L340","v":0},0,0,0,0,0,0,0,0,0,0,0]
["Total Capital Expenditure",null,{"$f":"C172+C341","v":64464111},{"$f":"D172+D341","v":109870266},0,0,0,9155855.5,-9155855.5,-1,109870266]
[{"$f":"head27a","v":"References"}]
["1. Insert 'Vote'; e.g. Department, if different to standard structure"]

{"sheet":"C6-FinPos","index":14,"n_rows":54,"n_cols":7,"rows_kept":54,"cut":false,"hidden":false,"merged":[[1,0,2,0],[1,1,2,1],[49,0,49,6],[0,0,0,6]]}
[{"$f":"muni& \" - \"&S71E& \" - \"&date","v":"LIM331 Greater Giyani - Table C6 Monthly Budget Statement - Financial Position - M01 July"}]
[{"$f":"desc","v":"Description"},{"$f":"head27","v":"Ref"},{"$f":"Head1","v":"2018/19"},{"$f":"Head2","v":"Budget Year 2019/20"}]
[null,null,{"$f":"Head5","v":"Audited Outcome"},{"$f":"Head6","v":"Original Budget"},{"$f":"Head7","v":"Adjusted Budget"},{"$f":"Head39","v":"YearTD actual"},{"$f":"Head8","v":"Full Year Forecast"}]
["R thousands",1]
["ASSETS"]
["Current assets"]
["Cash",null,40759300,31749594.559999824,null,153423193.09999999,31749594.559999801]
["Call investment deposits",null,0,0,null,18913204,0]
["Consumer debtors",null,95624027,38907075,null,59408801.599999987,38907075]
["Other debtors",null,0,21187185.723499998,null,65826946.620000012,21187185.723499998]
["Current portion of long-term receivables",null,0,0,null,0,0]
["Inventory",null,2335282,6991678.3200000003,null,4529596.66,6991678.3200000003]
["Total current assets",null,{"$f":"SUM(C7:C12)","v":138718609},{"$f":"SUM(D7:D12)","v":98835533.60349983},{"$f":"SUM(E7:E12)","v":0},{"$f":"SUM(F7:F12)","v":302101741.98000002},{"$f":"SUM(G7:G12)","v":98835533.6034998}]
[]
["Non current assets"]
["Long-term receivables",null,0,0,0,0,0]
["Investments",null,0,0,0,0,0]
["Investment property",null,11136000,11196000,0,11136000,11196000]
["Investments in Associate",null,0,0,0,0,0]
["Property, plant and equipment",null,869332557.60999978,927883084.87999988,0,869332557.60999978,927883084.87999988]
[null,null,0,0,0,0,0]
["Biological",null,0,0,0,0,0]
["Intangible",null,630044.83000000007,405379.42000000039,0,630044.83000000007,405379.42000000039]
["Other non-current assets",null,206302.63,171052.63,0,206302.63,171052.63]
["Total non current assets",null,{"$f":"SUM(C16:C20)+SUM(C22:C24)","v":881304905.06999981},{"$f":"SUM(D16:D20)+SUM(D22:D24)","v":939655516.92999983},{"$f":"SUM(E16:E20)+SUM(E22:E24)","v":0},{"$f":"SUM(F16:F20)+SUM(F22:F24)","v":881304905.06999981},{"$f":"SUM(G16:G20)+SUM(G22:G24)","v":939655516.92999983}]
["TOTAL ASSETS",null,{"$f":"C13+C25","v":1020023514.0699998},{"$f":"D13+D25","v":1038491050.5334997},{"$f":"E13+E25","v":0},{"$f":"F13+F25","v":1183406647.0499997},{"$f":"G13+G25","v":1038491050.5334996}]
[]
["LIABILITIES"]
["Current liabilities"]
["Bank overdraft",null,0,0,0,0,0]
["Borrowing",null,706994,0,0,0,0]
["Consumer deposits",null,0,0,0,0,0]
["Trade and other payables",null,73297428,60000000,0,83205125,60000000]
["Provisions",null,321080,58369347.059999995,0,72079310.50999999,58369347.059999995]
["Total current liabilities",null,{"$f":"SUM(C30:C34)","v":74325502},{"$f":"SUM(D30:D34)","v":118369347.06},{"$f":"SUM(E30:E34)","v":0},{"$f":"SUM(F30:F34)","v":155284435.50999999},{"$f":"SUM(G30:G34)","v":118369347.06}]
[]
["Non current liabilities"]
["Borrowing",null,480165.86,0,0,0,0]
["Provisions",null,50411219,0,0,0,0]
["Total non current liabilities",null,{"$f":"SUM(C38:C39)","v":50891384.859999999},{"$f":"SUM(D38:D39)","v":0},{"$f":"SUM(E38:E39)","v":0},{"$f":"SUM(F38:F39)","v":0},{"$f":"SUM(G38:G39)","v":0}]
["TOTAL LIABILITIES",null,{"$f":"C35+C40","v":125216886.86},{"$f":"D35+D40","v":118369347.06},{"$f":"E35+E40","v":0},{"$f":"F35+F40","v":155284435.50999999},{"$f":"G35+G40","v":118369347.06}]
[]
["NET ASSETS",2,{"$f":"C26-C41","v":894806627.2099998},{"$f":"D26-D41","v":920121703.47349977},{"$f":"E26-E41","v":0},{"$f":"F26-F41","v":1028122211.5399997},{"$f":"G26-G41","v":920121703.47349954}]
[]
["COMMUNITY WEALTH/EQUITY"]
["Accumulated Surplus/(Deficit)",null,894806627,920121703.47349977,0,{"$f":"1183406647.05-F35","v":1028122211.54},920121703.47349977]
["Reserves",null,0,0,0,0,0]
["TOTAL COMMUNITY WEALTH/EQUITY",2,{"$f":"SUM(C46:C47)","v":894806627},{"$f":"SUM(D46:D47)","v":920121703.47349977},{"$f":"SUM(E46:E47)","v":0},{"$f":"SUM(F46:F47)","v":1028122211.54},{"$f":"SUM(G46:G47)","v":920121703.47349977}]
[{"$f":"head27a","v":"References"}]
["1. Material variances to be explained in Table SC1"]
["2. Net assets must balance with Total Community Wealth/Equity"]
[]
[]
["check balance",null,{"$f":"C43-C48","v":0.20999979972839355},{"$f":"D43-D48","v":0},{"$f":"E43-E48","v":0},{"$f":"F43-F48","v":0},{"$f":"G43-G48","v":0}]

{"sheet":"C7-CFlow","index":15,"n_rows":43,"n_cols":11,"rows_kept":43,"cut":false,"hidden":false,"merged":[[1,0,2,0],[1,1,2,1],[0,0,0,10]]}
[{"$f":"muni& \" - \"&S71F& \" - \"&date","v":"LIM331 Greater Giyani - Table C7 Monthly Budget Statement - Cash Flow  - M01 July"}]
[{"$f":"desc","v":"Description"},{"$f":"head27","v":"Ref"},{"$f":"Head1","v":"2018/19"},{"$f":"Head2","v":"Budget Year 2019/20"}]
[null,null,{"$f":"Head5","v":"Audited Outcome"},{"$f":"Head6","v":"Original Budget"},{"$f":"Head7","v":"Adjusted Budget"},{"$f":"Head38","v":"Monthly actual"},{"$f":"Head39","v":"YearTD actual"},{"$f":"Head40","v":"YearTD budget"},{"$f":"Head41","v":"YTD variance"},{"$f":"Head41","v":"YTD variance"},{"$f":"Head8","v":"Full Year Forecast"}]
["R thousands",1,null,null,null,null,null,null,null,"%"]
["CASH FLOW FROM OPERATING ACTIVITIES"]
["Receipts"]
["Property rates",null,40659276,23985600,0,761285,{"$f":"F7","v":761285},{"$f":"1/12*D7","v":1998800},{"$f":"G7-H7","v":-1237515},{"$f":"IF(I7=0,\"\",I7/H7)","v":-0.61912897738643191},23985600]
["Service charges",null,4685205,3240000,0,184972,{"$f":"F8","v":184972},270000,-85028,{"$f":"IF(I8=0,\"\",I8/H8)","v":-0.31491851851851854},3240000]
["Other revenue",null,23660897,18473000,0,1992070.17,{"$f":"F9","v":1992070.17},1539416.6666666665,452653.50333333341,{"$f":"IF(I9=0,\"\",I9/H9)","v":0.29404222595138857},18473000]
["Government - operating",null,259208395,303024000,0,123674000,123674000,25252000,98422000,{"$f":"IF(I10=0,\"\",I10/H10)","v":3.8975922699192145},303024000]
["Government - capital",null,73177035,60688000,0,24275000,24275000,5057333.333333333,19217666.666666668,{"$f":"IF(I11=0,\"\",I11/H11)","v":3.7999604534669134},60688000]
["Interest",null,20389917,8400000,0,321171.17,321171.17,700000,-378828.83,-0.54118404285714283,8400000]
["Dividends",null,0,0,0,0,0,0,0,"",0]
["Payments"]
["Suppliers and employees",null,-330101975,-326190739.44000018,0,-14653498.54999998,{"$f":"F15","v":-14653498.54999998},{"$f":"1/12*D15","v":-27182561.620000012},{"$f":"H15-G15","v":-12529063.070000032},0.46092282416759317,-326190739.44000018]
["Finance charges",null,-294856,0,0,0,0,0,{"$f":"H16-G16","v":0},"",0]
["Transfers and Grants",null,null,0,0,0,0,0,{"$f":"H17-G17","v":0},"",0]
["NET CASH FROM/(USED) OPERATING ACTIVITIES",null,{"$f":"SUM(C7:C13)+SUM(C15:C17)","v":91383894},91619860.559999824,0,136554999.79000002,136554999.79000002,7634988.3799999878,{"$f":"H18-G18","v":-128920011.41000003},-16.885423394711207,{"$f":"SUM(K7:K13)+SUM(K15:K17)","v":91619860.559999824}]
[]
["CASH FLOWS FROM INVESTING ACTIVITIES"]
["Receipts"]
["Proceeds on disposal of PPE",null,0,0,0,0,0,0,{"$f":"G22-H22","v":0},{"$f":"IF(I22=0,\"\",I22/H22)","v":""},0]
["Decrease (Increase) in non-current debtors",null,0,0,0,0,0,0,{"$f":"G23-H23","v":0},"",0]
["Decrease (increase) other non-current receivables",null,0,0,0,0,0,0,{"$f":"G24-H24","v":0},"",0]
["Decrease (increase) in non-current investments",null,0,0,0,0,0,0,{"$f":"G25-H25","v":0},"",0]
["Payments"]
["Capital assets",null,-64464111,-109870266,0,0,0,{"$f":"1/12*D27","v":-9155855.5},{"$f":"H27-G27","v":-9155855.5},1,-109870266]
["NET CASH FROM/(USED) INVESTING ACTIVITIES",null,{"$f":"SUM(C22:C25)+C27","v":-64464111},{"$f":"SUM(D22:D25)+D27","v":-109870266},0,0,0,-9155855.5,{"$f":"H28-G28","v":-9155855.5},1,{"$f":"SUM(K22:K25)+K27","v":-109870266}]
[]
["CASH FLOWS FROM FINANCING ACTIVITIES"]
["Receipts"]
["Short term loans",null,0,0,0,0,0,0,{"$f":"G32-H32","v":0},{"$f":"IF(I32=0,\"\",I32/H32)","v":""},0]
["Borrowing long term/refinancing",null,0,0,0,0,0,0,{"$f":"G33-H33","v":0},"",0]
["Increase (decrease) in consumer deposits",null,0,0,0,0,0,0,{"$f":"G34-H34","v":0},"",0]
["Payments",null,null,null,null,null,null,null,null,""]
["Repayment of borrowing",null,-582652,0,0,-4977903.07,{"$f":"F36","v":-4977903.07},0,{"$f":"H36-G36","v":4977903.07},{"$error":"#DIV/0!"},0]
["NET CASH FROM/(USED) FINANCING ACTIVITIES",null,{"$f":"SUM(C32:C34)+C36","v":-582652},0,0,-4977903.07,-4977903.07,0,{"$f":"H37-G37","v":4977903.07},{"$error":"#DIV/0!"},{"$f":"SUM(K32:K34)+K36","v":0}]
[]
["NET INCREASE/ (DECREASE) IN CASH HELD",null,{"$f":"C18+C28+C37","v":26337131},-18250405.440000176,0,131577096.72000003,131577096.72000003,-1520867.1200000122,null,null,{"$f":"K18+K28+K37","v":-18250405.440000176}]
["Cash/cash equivalents at beginning:",null,14422164,{"$f":"'SC9'!C55","v":40759300},0,null,40759300,{"$f":"IF(E40=0, D40, E40)","v":40759300},null,null,{"$f":"G40","v":40759300}]
["Cash/cash equivalents at month/year end:",null,{"$f":"C39+C40","v":40759295},{"$f":"D39+D40","v":22508894.559999824},{"$f":"E39+E40","v":0},null,{"$f":"G39+G40","v":172336396.72000003},{"$f":"H39+H40","v":39238432.879999988},null,null,{"$f":"K39+K40","v":22508894.559999824}]
["References"]
["1. Material variances to be explained in Table SC1"]

{"sheet":"SC1","index":16,"n_rows":47,"n_cols":5,"rows_kept":47,"cut":false,"hidden":false,"merged":[[1,0,2,0],[1,1,2,1],[0,0,0,4]]}
[{"$f":"muni& \" - \"&S71G& \" - \"&date","v":"LIM331 Greater Giyani - Supporting Table SC1 Material variance explanations  - M01 July"}]
[{"$f":"head27","v":"Ref"},{"$f":"desc","v":"Description"}]
[null,null,"Variance","Reasons for material deviations","Remedial or corrective steps/remarks"]
[null,"R thousands"]
[1,{"$f":"'C4-FinPerf RE'!A5","v":"Revenue By Source"}]
[]
[]
[]
[]
[2,{"$f":"'C4-FinPerf RE'!A24","v":"Expenditure By Type"}]
[]
[]
[]
[]
[3,{"$f":"RIGHT('C5-Capex'!A40,19)","v":"Capital Expenditure"}]
[]
[]
[]
[]
[4,"Financial Position"]
[]
[]
[]
[]
[5,"Cash Flow"]
[]
[]
[]
[]
[6,"Measureable performance"]
[]
[]
[]
[]
[7,"Municipal Entities"]
[]
[]
[]
[]
[]
[{"$f":"head27a","v":"References"}]
["1. Revenue for each source, vote and standard classification"]
["2. Expenditure for each type, vote and standard classification"]
["3. Capital expenditure for each vote and standard classification"]
["4. Explain any material variances between the annual budget and the expected financial position based on current trends"]
["5. Cash receipts by source and cash payments by type where not explained under revenue and expenditure"]
["6. For Sept, Dec, Mar and Jun statements explain any material variances in achievement of measurable performance objectives"]

{"sheet":"SC2","index":17,"n_rows":65,"n_cols":8,"rows_kept":65,"cut":false,"hidden":false,"merged":[[1,0,2,0],[1,1,2,1],[1,2,2,2],[0,0,0,7]]}
[{"$f":"muni& \" - \"&S71H& \" - \"&Head57","v":"LIM331 Greater Giyani - Supporting Table SC2 Monthly Budget Statement - performance indicators   - M01 July"}]
["Description of financial indicator","Basis of calculation",{"$f":"head27","v":"Ref"},{"$f":"Head1","v":"2018/19"},{"$f":"Head2","v":"Budget Year 2019/20"}]
[null,null,null,{"$f":"Head5","v":"Audited Outcome"},{"$f":"Head6","v":"Original Budget"},{"$f":"Head7","v":"Adjusted Budget"},{"$f":"Head39","v":"YearTD actual"},{"$f":"Head8","v":"Full Year Forecast"}]
[]
["Borrowing Management"]
[]
["Capital Charges to Operating Expenditure","Interest & principal paid/Operating Expenditure",null,{"$f":"IF(ISERROR((D42-D43)/D45),0,((D42-D43)/D45))","v":-7.3597700965126695E-4},{"$f":"IF(ISERROR((E42+E44)/E45),0,((E42+E44)/E45))","v":8.0603832446605558E-2},{"$f":"IF(ISERROR((F42+F44)/F45),0,((F42+F44)/F45))","v":0},{"$f":"IF(ISERROR((G42+G44)/G45),0,((G42+G44)/G45))","v":0},{"$f":"IF(ISERROR((H42+H44)/H45),0,((H42+H44)/H45))","v":6.4274980097554224E-2}]
["Borrowed funding of 'own' capital expenditure","Borrowings/Capital expenditure excl. transfers and grants",null,{"$f":"IF(ISERROR(D47/D46),0,(D47/D46))","v":0},{"$f":"IF(ISERROR(E47/E46),0,(E47/E46))","v":0},{"$f":"IF(ISERROR(F47/F46),0,(F47/F46))","v":0},{"$f":"IF(ISERROR(G47/G46),0,(G47/G46))","v":0},{"$f":"IF(ISERROR(H47/H46),0,(H47/H46))","v":0}]
["Safety of Capital"]
["Debt to Equity","Loans, Accounts Payable, Overdraft & Tax Provision/ Funds & Reserves",null,{"$f":"IF(ISERROR(D48/D49),0,(D48/D49))","v":8.3240988178331851E-2},{"$f":"IF(ISERROR(E48/E49),0,(E48/E49))","v":6.5208765072595695E-2},{"$f":"IF(ISERROR(F48/F49),0,(F48/F49))","v":0},{"$f":"IF(ISERROR(G48/G49),0,(G48/G49))","v":8.0929216455083691E-2},{"$f":"IF(ISERROR(H48/H49),0,(H48/H49))","v":6.5208765072595695E-2}]
["Gearing","Long Term Borrowing/ Funds & Reserves",null,{"$f":"IF(ISERROR(D51/D50),0,(D51/D50))","v":0},{"$f":"IF(ISERROR(E51/E50),0,(E51/E50))","v":0},{"$f":"IF(ISERROR(F51/F50),0,(F51/F50))","v":0},{"$f":"IF(ISERROR(G51/G50),0,(G51/G50))","v":0},{"$f":"IF(ISERROR(H51/H50),0,(H51/H50))","v":0}]
["Liquidity"]
["Current Ratio","Current assets/current liabilities",1,{"$f":"IF(ISERROR(D52/D53),0,(D52/D53))","v":1.8663662574387994},{"$f":"IF(ISERROR(E52/E53),0,(E52/E53))","v":0.83497574379118},{"$f":"IF(ISERROR(F52/F53),0,(F52/F53))","v":0},{"$f":"IF(ISERROR(G52/G53),0,(G52/G53))","v":1.9454734210019735},{"$f":"IF(ISERROR(H52/H53),0,(H52/H53))","v":0.83497574379117978}]
["Liquidity Ratio","Monetary Assets/Current Liabilities",null,{"$f":"IF(ISERROR(D54/D53),0,(D54/D53))","v":0.54838916526927728},{"$f":"IF(ISERROR(E54/E53),0,(E54/E53))","v":0.26822480100279961},{"$f":"IF(ISERROR(F54/F53),0,(F54/F53))","v":0},{"$f":"IF(ISERROR(G54/G53),0,(G54/G53))","v":1.1098111445232506},{"$f":"IF(ISERROR(H54/H53),0,(H54/H53))","v":0.26822480100279944}]
["Revenue Management"]
["Annual Debtors Collection Rate \n(Payment Level %)","Last 12 Mths Receipts/ Last 12 Mths Billing"]
["Outstanding Debtors to Revenue","Total Outstanding Debtors to Annual Revenue",null,{"$f":"IF(ISERROR(D59/D55),0,(D59/D55))","v":0.276228634911662},{"$f":"IF(ISERROR(E59/E55),0,(E59/E55))","v":0.15966676866698726},{"$f":"IF(ISERROR(F59/F55),0,(F59/F55))","v":0},{"$f":"IF(ISERROR(G59/G55),0,(G59/G55))","v":0.94735023414213637},{"$f":"IF(ISERROR(H59/H55),0,(H59/H55))","v":0.15966676866698726}]
["Longstanding Debtors Recovered","Debtors > 12 Mths Recovered/Total Debtors > \n12 Months Old",null,{"$f":"IF(ISERROR(D64/D63),0,(D64/D63))","v":0},{"$f":"IF(ISERROR(E64/E63),0,(E64/E63))","v":0},{"$f":"IF(ISERROR(F64/F63),0,(F64/F63))","v":0},{"$f":"IF(ISERROR(G64/G63),0,(G64/G63))","v":0},{"$f":"IF(ISERROR(H64/H63),0,(H64/H63))","v":0}]
["Creditors Management"]
["Creditors System Efficiency","% of Creditors Paid Within Terms (within MFMA s 65(e))",null,1,1,1,1,1]
["Funding of Provisions"]
["Percentage Of Provisions Not Funded","Unfunded Provisions/Total Provisions"]
["Other Indicators"]
["Electricity Distribution Losses","% Volume (units purchased and generated less units sold)/units purchased and generated",2]
["Water Distribution Losses","% Volume (units purchased and own source less units sold)/Total units purchased and own source",2]
["Employee costs","Employee costs/Total Revenue - capital revenue",null,{"$f":"IF(ISERROR(D40/D55),0,(D40/D55))","v":0.37690071099894523},{"$f":"IF(ISERROR(E40/E55),0,(E40/E55))","v":0.43720197740007949},{"$f":"IF(ISERROR(F40/F55),0,(F40/F55))","v":0},{"$f":"IF(ISERROR(G40/G55),0,(G40/G55))","v":8.324708714810039E-2},{"$f":"IF(ISERROR(H40/H55),0,(H40/H55))","v":0.43720197740007949}]
["Repairs & Maintenance","R&M/Total Revenue - capital revenue",null,{"$f":"IF(ISERROR(D41/D55),0,(D41/D55))","v":1.2925751114278922E-2},{"$f":"IF(ISERROR(E41/E55),0,(E41/E55))","v":3.888429828919715E-2},{"$f":"IF(ISERROR(F41/F55),0,(F41/F55))","v":0},{"$f":"IF(ISERROR(G41/G55),0,(G41/G55))","v":3.9533596447603285E-3},{"$f":"IF(ISERROR(H41/H55),0,(H41/H55))","v":3.888429828919715E-2}]
["Interest & Depreciation","I&D/Total Revenue - capital revenue",null,{"$f":"IF(ISERROR((D42+D44)/D55),0,((D42+D44)/D55))","v":0.25049006534189378},{"$f":"IF(ISERROR((E42+E44)/E55),0,((E42+E44)/E55))","v":7.9708161850079576E-2},{"$f":"IF(ISERROR((F42+F44)/F55),0,((F42+F44)/F55))","v":0},{"$f":"IF(ISERROR((G42+G44)/G55),0,((G42+G44)/G55))","v":0},{"$f":"IF(ISERROR((H42+H44)/H55),0,((H42+H44)/H55))","v":6.3560755872498834E-2}]
["IDP regulation financial viability indicators"]
["i. Debt coverage","(Total Operating Revenue - Operating Grants)/Debt service payments due within financial year)"]
["ii. O/S Service Debtors to Revenue","Total outstanding service debtors/annual revenue received for services"]
["iii. Cost coverage","(Available cash + Investments)/monthly fixed operational expenditure"]
["References"]
["1. Consumer debtors > 12 months old are excluded from current assets."]
["2. Material variances to be explained."]
[]
["Calculations"]
[{"$f":"'C6-FinPos'!A38","v":"Borrowing"},null,null,{"$f":"'C6-FinPos'!C38","v":480165.86},{"$f":"'C6-FinPos'!D38","v":0},{"$f":"'C6-FinPos'!E38","v":0},{"$f":"'C6-FinPos'!F38","v":0},0]
["Total Assets",null,null,{"$f":"'C6-FinPos'!C26","v":1020023514.0699998},{"$f":"'C6-FinPos'!D26","v":1038491050.5334997},{"$f":"'C6-FinPos'!E26","v":0},{"$f":"'C6-FinPos'!F26","v":1183406647.0499997},{"$f":"'C6-FinPos'!G26","v":1038491050.5334996}]
[{"$f":"'C4-FinPerf RE'!A25","v":"Employee related costs"},null,null,{"$f":"'C4-FinPerf RE'!C25","v":130474394.06999998},{"$f":"'C4-FinPerf RE'!D25","v":164551019.84000012},{"$f":"'C4-FinPerf RE'!E25","v":0},{"$f":"'C4-FinPerf RE'!G25","v":11004917.579999985},{"$f":"'C4-FinPerf RE'!K25","v":164551019.84000012}]
[{"$f":"A27","v":"Repairs & Maintenance"},null,null,4474599,{"$f":"SC13c!D166","v":14635000},null,{"$f":"SC13c!F166","v":522617.65},{"$f":"E41","v":14635000}]
["Interest (finance charges)",null,null,{"$f":"'C4-FinPerf RE'!C29","v":294856.32000000001},{"$f":"'C4-FinPerf RE'!D29","v":0},{"$f":"'C4-FinPerf RE'!E29","v":0},{"$f":"'C4-FinPerf RE'!G29","v":0},{"$f":"'C4-FinPerf RE'!K29","v":0}]
["Principal paid",null,null,{"$f":"-'C7-CFlow'!C36","v":582652},{"$f":"-'C7-CFlow'!D36","v":0},{"$f":"-'C7-CFlow'!E36","v":0},{"$f":"-'C7-CFlow'!G36","v":4977903.07},{"$f":"-'C7-CFlow'!K36","v":0}]
["Depreciation",null,null,{"$f":"'C4-FinPerf RE'!C28","v":86419067.38000001},{"$f":"'C4-FinPerf RE'!D28","v":30000000},{"$f":"'C4-FinPerf RE'!E28","v":0},null,{"$f":"'C4-FinPerf RE'!K26","v":23922552.370000001}]
["Operating expenditure",null,null,{"$f":"'C4-FinPerf RE'!C36","v":391038953.96999997},{"$f":"'C4-FinPerf RE'!D36","v":372190739.44000018},{"$f":"'C4-FinPerf RE'!E36","v":0},{"$f":"'C4-FinPerf RE'!G36","v":14653498.549999984},{"$f":"'C4-FinPerf RE'!K36","v":372190739.44000018}]
[{"$f":"'C5-Capex'!A40","v":"Total Capital Expenditure"},null,null,{"$f":"'C5-Capex'!C40","v":64464111},{"$f":"'C5-Capex'!D40","v":109870266},{"$f":"'C5-Capex'!E40","v":0},{"$f":"'C5-Capex'!G40","v":0},{"$f":"'C5-Capex'!K40","v":109870266}]
["Borrowed funding for capital",null,null,{"$f":"'C5-Capex'!C72","v":0},{"$f":"'C5-Capex'!D72","v":0},{"$f":"'C5-Capex'!E72","v":0},{"$f":"'C5-Capex'!G72","v":0},{"$f":"'C5-Capex'!K72","v":0}]
["Debt",null,null,{"$f":"'C6-FinPos'!C30+'C6-FinPos'!C31+'C6-FinPos'!C33+'C6-FinPos'!C38","v":74484587.859999999},{"$f":"'C6-FinPos'!D30+'C6-FinPos'!D31+'C6-FinPos'!D33+'C6-FinPos'!D38","v":60000000},{"$f":"'C6-FinPos'!E30+'C6-FinPos'!E31+'C6-FinPos'!E33+'C6-FinPos'!E38","v":0},{"$f":"'C6-FinPos'!F30+'C6-FinPos'!F31+'C6-FinPos'!F33+'C6-FinPos'!F38","v":83205125},{"$f":"'C6-FinPos'!G30+'C6-FinPos'!G31+'C6-FinPos'!G33+'C6-FinPos'!G38","v":60000000}]
["Equity",null,null,{"$f":"'C6-FinPos'!C48","v":894806627},{"$f":"'C6-FinPos'!D48","v":920121703.47349977},{"$f":"'C6-FinPos'!E48","v":0},{"$f":"'C6-FinPos'!F48","v":1028122211.54},{"$f":"'C6-FinPos'!G48","v":920121703.47349977}]
[{"$f":"'C6-FinPos'!A47","v":"Reserves"},null,null,{"$f":"'C6-FinPos'!C47","v":0},{"$f":"'C6-FinPos'!D47","v":0},{"$f":"'C6-FinPos'!E47","v":0},{"$f":"'C6-FinPos'!F47","v":0},{"$f":"'C6-FinPos'!G47","v":0}]
[{"$f":"'C6-FinPos'!A38","v":"Borrowing"},null,null,{"$f":"'C6-FinPos'!C38","v":480165.86},{"$f":"'C6-FinPos'!D38","v":0},{"$f":"'C6-FinPos'!E38","v":0},{"$f":"'C6-FinPos'!F38","v":0},{"$f":"'C6-FinPos'!G38","v":0}]
[{"$f":"'C6-FinPos'!A6","v":"Current assets"},null,null,{"$f":"'C6-FinPos'!C13","v":138718609},{"$f":"'C6-FinPos'!D13","v":98835533.60349983},{"$f":"'C6-FinPos'!E13","v":0},{"$f":"'C6-FinPos'!F13","v":302101741.98000002},{"$f":"'C6-FinPos'!G13","v":98835533.6034998}]
[{"$f":"'C6-FinPos'!A29","v":"Current liabilities"},null,null,{"$f":"'C6-FinPos'!C35","v":74325502},{"$f":"'C6-FinPos'!D35","v":118369347.06},{"$f":"'C6-FinPos'!E35","v":0},{"$f":"'C6-FinPos'!F35","v":155284435.50999999},{"$f":"'C6-FinPos'!G35","v":118369347.06}]
["Monetary assets",null,null,{"$f":"'C6-FinPos'!C7+'C6-FinPos'!C8","v":40759300},{"$f":"'C6-FinPos'!D7+'C6-FinPos'!D8","v":31749594.559999824},{"$f":"'C6-FinPos'!E7+'C6-FinPos'!E8","v":0},{"$f":"'C6-FinPos'!F7+'C6-FinPos'!F8","v":172336397.09999999},{"$f":"'C6-FinPos'!G7+'C6-FinPos'!G8","v":31749594.559999801}]
[{"$f":"'C4-FinPerf RE'!A22","v":"Total Revenue (excluding capital transfers and contributions)"},null,null,{"$f":"'C4-FinPerf RE'!C22","v":346177097.20999998},{"$f":"'C4-FinPerf RE'!D22","v":376373000},{"$f":"'C4-FinPerf RE'!E22","v":0},{"$f":"'C4-FinPerf RE'!G22","v":132195827.59},{"$f":"'C4-FinPerf RE'!K22","v":376373000}]
[{"$f":"'C4-FinPerf RE'!A19","v":"Transfers and subsidies"},null,null,{"$f":"'C4-FinPerf RE'!C19","v":259208395.21000001},{"$f":"'C4-FinPerf RE'!D19","v":303024000},{"$f":"'C4-FinPerf RE'!E19","v":0},{"$f":"'C4-FinPerf RE'!G19","v":123674000},{"$f":"'C4-FinPerf RE'!K19","v":303024000}]
[{"$f":"'C4-FinPerf RE'!A39","v":"Transfers and subsidies - capital (monetary allocations) (National / Provincial and District)"},null,null,{"$f":"'C4-FinPerf RE'!C39","v":73177035},{"$f":"'C4-FinPerf RE'!D39","v":60688000},{"$f":"'C4-FinPerf RE'!E39","v":0},{"$f":"'C4-FinPerf RE'!G39","v":24275000},{"$f":"'C4-FinPerf RE'!K39","v":60688000}]
["Debt service payments",null,null,{"$f":"'C7-CFlow'!C12+'C7-CFlow'!C36","v":19807265},{"$f":"'C7-CFlow'!D12+'C7-CFlow'!D36","v":8400000},{"$f":"'C7-CFlow'!E12+'C7-CFlow'!E36","v":0},{"$f":"'C7-CFlow'!G16+'C7-CFlow'!G36","v":-4977903.07},{"$f":"'C7-CFlow'!K16+'C7-CFlow'!K36","v":0}]
["Outstanding debtors (receivables)",null,null,{"$f":"'C6-FinPos'!C9+'C6-FinPos'!C10+'C6-FinPos'!C11+'C6-FinPos'!C16","v":95624027},{"$f":"'C6-FinPos'!D9+'C6-FinPos'!D10+'C6-FinPos'!D11+'C6-FinPos'!D16","v":60094260.723499998},{"$f":"'C6-FinPos'!E9+'C6-FinPos'!E10+'C6-FinPos'!E11+'C6-FinPos'!E16","v":0},{"$f":"'C6-FinPos'!F9+'C6-FinPos'!F10+'C6-FinPos'!F11+'C6-FinPos'!F16","v":125235748.22},{"$f":"'C6-FinPos'!G9+'C6-FinPos'!G10+'C6-FinPos'!G11+'C6-FinPos'!G16","v":60094260.723499998}]
["Annual services revenue",null,null,{"$f":"SUM('C4-FinPerf RE'!C7:C11)","v":4477862.1399999997},{"$f":"SUM('C4-FinPerf RE'!D7:D11)","v":5400000},{"$f":"SUM('C4-FinPerf RE'!E7:E11)","v":0},{"$f":"SUM('C4-FinPerf RE'!G7:G11)","v":406533.39999999991}]
["Cash + investments","Including LT investments",null,{"$f":"'C6-FinPos'!C7+'C6-FinPos'!C8+'C6-FinPos'!C17-'C6-FinPos'!C30","v":40759300},{"$f":"'C6-FinPos'!D7+'C6-FinPos'!D8+'C6-FinPos'!D17-'C6-FinPos'!D30","v":31749594.559999824},{"$f":"'C6-FinPos'!E7+'C6-FinPos'!E8+'C6-FinPos'!E17-'C6-FinPos'!E30","v":0},{"$f":"'C6-FinPos'!F7+'C6-FinPos'!F8+'C6-FinPos'!F17-'C6-FinPos'!F30","v":172336397.09999999},{"$f":"'C6-FinPos'!G7+'C6-FinPos'!G8+'C6-FinPos'!G17-'C6-FinPos'!G30","v":31749594.559999801}]
["Fixed operational expend. (monthly)"]
["Longstanding debtors outstanding",null,null,{"$f":"'C6-FinPos'!C16","v":0},{"$f":"'C6-FinPos'!D16","v":0},{"$f":"'C6-FinPos'!E16","v":0},{"$f":"'C6-FinPos'!F16","v":0},{"$f":"'C6-FinPos'!G16","v":0}]
["Longstanding debtors recovered"]
["Attorney collections"]

{"sheet":"SC3","index":18,"n_rows":27,"n_cols":14,"rows_kept":27,"cut":false,"hidden":false,"merged":[[0,0,0,12],[1,2,1,13]]}
[{"$f":"muni& \" - \"&S71I& \" - \"&Head57","v":"LIM331 Greater Giyani - Supporting Table SC3 Monthly Budget Statement - aged debtors - M01 July"}]
[{"$f":"desc","v":"Description"},null,{"$f":"Head2","v":"Budget Year 2019/20"}]
["R thousands","NT Code","0-30 Days","31-60 Days","61-90 Days","91-120 Days","121-150 Dys","151-180 Dys","181 Dys-1 Yr","Over 1Yr","Total","Total \nover 90 days","Actual Bad Debts Written Off against Debtors","Impairment - Bad Debts i.t.o Council Policy"]
["Debtors Age Analysis By Income Source"]
["Trade and Other Receivables from Exchange Transactions - Water",1200,null,null,null,null,null,null,null,null,{"$f":"SUM(C5:J5)","v":0},{"$f":"SUM(F5:J5)","v":0}]
["Trade and Other Receivables from Exchange Transactions - Electricity",1300,0,0,0,0,0,0,0,0,{"$f":"SUM(C6:J6)","v":0},{"$f":"SUM(F6:J6)","v":0}]
["Receivables from Non-exchange Transactions - Property Rates",1400,3043657.3500000127,2290055.7300000498,2301956.8300000527,2163224.9200000498,2185113.0200000498,2157896.8800000497,15185729.540000081,69513249.980000198,{"$f":"SUM(C7:J7)","v":98840884.250000536},91205214.340000421]
["Receivables from Exchange Transactions - Waste Water Management",1500,null,null,null,null,null,null,null,null,0,0]
["Receivables from Exchange Transactions - Waste Management",1600,285216.7799999959,359458.26999998081,316107.22999998194,277059.08999998262,328750.44999998203,305377.89999998175,2070351.7600000328,18708401.619999446,22650723.099999383,{"$f":"SUM(F9:J9)","v":21689940.819999427}]
["Receivables from Exchange Transactions - Property Rental Debtors",1700,62450,50363,49788.93,48686,49076,49076,341053.8,3199890.2400000007,3850383.9700000007,{"$f":"SUM(F10:J10)","v":3687782.0400000005}]
["Interest on Arrear Debtor Accounts",1810,2189766.5100000002,1975433.4200000018,2008798.5899999978,1916838.0399999996,1949651.6400000013,1734097.9699999979,12432752.899999987,74694491.180001095,98901830.250001073,92727831.730001077]
["Recoverable unauthorised, irregular, fruitless and wasteful expenditure",1820,0,0,0,0,0,0,0,0,0,0]
["Other",1900,10500.800000002053,11260.769999999544,-2894.2800000004213,13165.100000000168,14866.050000000605,18350.510000000722,95068.90999999606,875750.56000001926,1036068.420000018,{"$f":"SUM(F13:J13)","v":1017201.1300000169}]
["Total By Income Source",2000,{"$f":"SUM(C5:C13)","v":5591591.4400000107},4686571.1900000321,4673757.3000000324,4418973.150000033,4527457.1600000337,4264799.2600000305,30124956.910000097,166991783.58000076,225279889.99000102,{"$f":"SUM(L5:L13)","v":210327970.06000096},0,0]
[{"$f":"Head1&\" - totals only\"","v":"2018/19 - totals only"},null,null,null,null,null,null,null,null,null,{"$f":"SUM(C15:J15)","v":0},{"$f":"SUM(F15:J15)","v":0}]
["Debtors Age Analysis By Customer Group"]
["Organs of State",2200,2435766,2076222,1369269,1878737,1889399,1808085,12728012,39335944,{"$f":"SUM(C17:J17)","v":63521434},{"$f":"SUM(F17:J17)","v":57640177}]
["Commercial",2300,903349,763487,531566,436855,478775,423988,3386490,24451084,{"$f":"SUM(C18:J18)","v":31375594},{"$f":"SUM(F18:J18)","v":29177192}]
["Households",2400,2252476,1846862,2772922,2103381,2159283,2032726,14010455,103204756,{"$f":"SUM(C19:J19)","v":130382861},{"$f":"SUM(F19:J19)","v":123510601}]
["Other",2500,null,0,0,0,0,0,0,0,{"$f":"SUM(C20:J20)","v":0},{"$f":"SUM(F20:J20)","v":0}]
["Total By Customer Group",2600,{"$f":"SUM(C17:C20)","v":5591591},4686571,4673757,4418973,4527457,4264799,30124957,{"$f":"SUM(J17:J20)","v":166991784},{"$f":"SUM(K17:K20)","v":225279889},{"$f":"SUM(L17:L20)","v":210327970},{"$f":"SUM(M17:M20)","v":0},{"$f":"SUM(N17:N20)","v":0}]
["Notes"]
["Material increases in value of debtors' categories compared to previous month to be explained"]
["Bad debts = amounts actually written off in the month"]
["Total by Income Source must reconcile with Total by Customer Group"]
[null,null,{"$f":"C14-C21","v":0.44000001065433025},{"$f":"D14-D21","v":0.19000003207474947},{"$f":"E14-E21","v":0.3000000324100256},0.15000003296881914,0.1600000336766243,0.26000003051012754,-8.9999902993440628E-2,{"$f":"J14-J21","v":-0.41999924182891846},0.99000102281570435]
[null,null,{"$f":"IF(C26=0,\"\",\"MUST AGREE\")","v":"MUST AGREE"},{"$f":"IF(D26=0,\"\",\"MUST AGREE\")","v":"MUST AGREE"},"MUST AGREE","MUST AGREE","MUST AGREE","MUST AGREE","MUST AGREE","MUST AGREE","MUST AGREE"]

{"sheet":"SC4","index":19,"n_rows":17,"n_cols":12,"rows_kept":17,"cut":false,"hidden":false,"merged":[[1,11,3,11],[0,0,0,10],[2,8,3,8],[2,9,3,9],[2,10,3,10],[2,4,3,4],[2,5,3,5],[2,6,3,6],[2,7,3,7],[1,0,2,0],[1,1,3,1],[2,2,3,2],[2,3,3,3]]}
[{"$f":"muni& \" - \"&S71J& \" - \"&Head57","v":"LIM331 Greater Giyani - Supporting Table SC4 Monthly Budget Statement - aged creditors  - M01 July"}]
[{"$f":"desc","v":"Description"},"NT Code",{"$f":"Head2","v":"Budget Year 2019/20"},null,null,null,null,null,null,null,null,"Prior year totals for chart (same period)"]
[null,null,"0 - \n30 Days","31 - \n60 Days","61 - \n90 Days","91 - \n120 Days","121 - \n150 Days","151 - \n180 Days","181 Days -\n1 Year","Over 1\nYear","Total\n"]
["R thousands"]
["Creditors Age Analysis By Customer Type"]
["Bulk Electricity","0100",0,0,0,0,0,0,0,0,{"$f":"SUM(C6:J6)","v":0}]
["Bulk Water","0200",0,0,0,0,0,0,0,0,{"$f":"SUM(C7:J7)","v":0}]
["PAYE deductions","0300",0,0,0,0,0,0,0,0,0]
["VAT (output less input)","0400",0,0,0,0,0,0,0,0,0]
["Pensions / Retirement deductions","0500",0,0,0,0,0,0,0,0,0]
["Loan repayments","0600",0,0,0,0,0,0,0,0,0]
["Trade Creditors","0700",-2096868,3125601,-19759,19759,65573,-67414,-653401,653401,1026892]
["Auditor General","0800",0,0,0,0,0,0,0,0,0]
["Other","0900",-4350780,5050285,-1646856,1646856,0,-1,-29245,29245,{"$f":"SUM(C14:J14)","v":699504}]
["Total By Customer Type",1000,{"$f":"SUM(C6:C14)","v":-6447648},{"$f":"SUM(D6:D14)","v":8175886},-1666615,1666615,65573,-67415,-682646,682646,{"$f":"SUM(K6:K14)","v":1726396},{"$f":"SUM(L6:L14)","v":0}]
["Notes"]
["Material increases in value of creditors' categories compared to previous month to be explained"]

{"sheet":"SC5","index":20,"n_rows":28,"n_cols":15,"rows_kept":28,"cut":false,"hidden":false,"merged":[[2,10,2,14],[0,0,0,9],[1,1,2,1],[1,3,2,3],[1,9,2,9]]}
[{"$f":"muni& \" - \"&S71K& \" - \"&Head57","v":"LIM331 Greater Giyani - Supporting Table SC5 Monthly Budget Statement - investment portfolio  - M01 July"}]
["Investments by maturity\nName of institution & investment ID","Ref","Period of Investment","Type of Investment","Capital Guarantee\n(Yes/ No)","Variable or Fixed interest rate","Interest Rate ᶟ","Commission Paid (Rands)","Commission Recipient","Expiry date of investment","Opening balance","Interest to be realised","Partial / Premature Withdrawal (4)","Investment Top Up","Closing Balance"]
["R thousands",null,"Yrs/Months"]
["Municipality"]
[null,null,null,null,null,null,null,null,null,null,null,null,null,null,{"$f":"SUM(K5:N5)","v":0}]
[null,null,null,null,null,null,null,null,null,null,null,null,null,null,0]
[null,null,null,null,null,null,null,null,null,null,null,null,null,null,0]
[null,null,null,null,null,null,null,null,null,null,null,null,null,null,0]
[null,null,null,null,null,null,null,null,null,null,null,null,null,null,0]
[null,null,null,null,null,null,null,null,null,null,null,null,null,null,0]
[null,null,null,null,null,null,null,null,null,null,null,null,null,null,0]
["Municipality sub-total",null,null,null,null,null,null,null,null,null,{"$f":"SUM(K5:K11)","v":0},null,{"$f":"SUM(M5:M11)","v":0},{"$f":"SUM(N5:N11)","v":0},{"$f":"SUM(O5:O11)","v":0}]
[]
["Entities"]
[null,null,null,null,null,null,null,null,null,null,null,null,null,null,{"$f":"SUM(K15:N15)","v":0}]
[null,null,null,null,null,null,null,null,null,null,null,null,null,null,0]
[null,null,null,null,null,null,null,null,null,null,null,null,null,null,0]
[null,null,null,null,null,null,null,null,null,null,null,null,null,null,0]
[null,null,null,null,null,null,null,null,null,null,null,null,null,null,0]
[null,null,null,null,null,null,null,null,null,null,null,null,null,null,0]
[null,null,null,null,null,null,null,null,null,null,null,null,null,null,0]
["Entities sub-total",null,null,null,null,null,null,null,null,null,{"$f":"SUM(K15:K21)","v":0},null,{"$f":"SUM(M15:M21)","v":0},{"$f":"SUM(N15:N21)","v":0},{"$f":"SUM(O15:O21)","v":0}]
[]
["TOTAL INVESTMENTS AND INTEREST",2,null,null,null,null,null,null,null,null,{"$f":"K12+K22","v":0},null,{"$f":"M12+M22","v":0},{"$f":"N12+N22","v":0},{"$f":"O12+O22","v":0}]
[{"$f":"head27a","v":"References"}]
["2. List investments in expiry date order"]
["3. If 'variable' is selected in column F, input interest rate range"]
["4. Withdrawals to be entered as negative"]

{"sheet":"SC6","index":21,"n_rows":77,"n_cols":11,"rows_kept":77,"cut":false,"hidden":false,"merged":[[1,0,2,0],[1,1,2,1],[0,0,0,10]]}
[{"$f":"muni& \" - \"&S71L& \" - \"&Head57","v":"LIM331 Greater Giyani - Supporting Table SC6 Monthly Budget Statement - transfers and grant receipts  - M01 July"}]
[{"$f":"desc","v":"Description"},{"$f":"head27","v":"Ref"},{"$f":"Head1","v":"2018/19"},{"$f":"Head2","v":"Budget Year 2019/20"}]
[null,null,{"$f":"Head5","v":"Audited Outcome"},{"$f":"Head6","v":"Original Budget"},{"$f":"Head7","v":"Adjusted Budget"},{"$f":"Head38","v":"Monthly actual"},{"$f":"Head39","v":"YearTD actual"},{"$f":"Head40","v":"YearTD budget"},{"$f":"Head41","v":"YTD variance"},{"$f":"Head41","v":"YTD variance"},{"$f":"Head8","v":"Full Year Forecast"}]
["R thousands",null,null,null,null,null,null,null,null,"%"]
["RECEIPTS:","1,2"]
[]
["Operating Transfers and Grants"]
["National Government:",null,{"$f":"SUM(C9:C19)","v":0},302724000,0,123674000,123674000,25227000,95739250,{"$f":"IF(I8=0,\"\",I8/H8)","v":3.7951103975898839},{"$f":"SUM(K9:K19)","v":302724000}]
["Local Government Equitable Share",null,null,287217000,null,119674000,119674000,{"$f":"1/12*D9","v":23934750},{"$f":"G9-H9","v":95739250},4.0000104450641851,287217000]
["Finance Management ",null,null,2145000,null,null,null,{"$f":"1/12*D10","v":178750},null,null,2145000]
["Integrated National Electrification Programme",null,null,10000000,null,4000000,4000000,833333.33333333326,null,null,10000000]
["EPWP Incentive",null,null,3362000,null,null,null,280166.66666666663,null,null,3362000]
[]
[null,3,null,null,null,null,null,null,0,""]
[null,null,null,null,null,null,null,null,0,""]
[null,null,null,null,null,null,null,null,0,""]
[null,null,null,null,null,null,null,null,0,""]
[null,null,null,null,null,null,null,null,0,""]
[null,null,null,null,null,null,null,null,0,""]
["Provincial Government:",null,{"$f":"SUM(C21:C26)","v":0},300000,0,0,0,25000,-25000,-1,{"$f":"SUM(K21:K26)","v":300000}]
[null,null,null,null,null,null,null,null,{"$f":"G21-H21","v":0},""]
[]
[null,null,null,null,null,null,null,null,0,""]
[null,4,null,null,null,null,null,null,0,""]
[null,null,null,null,null,null,null,null,0,""]
["LG SETA",null,null,300000,null,null,null,{"$f":"1/12*D26","v":25000},-25000,-1,300000]
["District Municipality:",null,{"$f":"SUM(C28:C29)","v":0},0,0,0,0,0,0,"",{"$f":"SUM(K28:K29)","v":0}]
["[insert description]",null,null,null,null,null,null,null,0,""]
[null,null,null,null,null,null,null,null,0,""]
["Other grant providers:",null,{"$f":"SUM(C31:C37)","v":0},0,0,0,0,0,0,"",{"$f":"SUM(K31:K37)","v":0}]
["[insert description]",null,null,null,null,null,null,null,0,""]
[]
[]
[]
[]
[]
[null,null,null,null,null,null,null,null,0,""]
["Total Operating Transfers and Grants",5,{"$f":"C8+C20+C27+C30","v":0},303024000,0,123674000,123674000,25252000,95714250,3.7903631395533028,{"$f":"K8+K20+K27+K30","v":303024000}]
[]
["Capital Transfers and Grants"]
[{"$f":"A8","v":"National Government:"},null,{"$f":"SUM(C42:C51)","v":0},60688000,0,24275000,24275000,5057333.333333333,19217666.666666668,{"$f":"IF(I41=0,\"\",I41/H41)","v":3.7999604534669134},60688000]
["Municipal Infrastructure Grant (MIG)",null,null,60688000,null,24275000,24275000,{"$f":"1/12*D42","v":5057333.333333333},{"$f":"G42-H42","v":19217666.666666668},3.7999604534669134,60688000]
[]
[]
[]
[]
[null,null,null,null,null,null,null,null,0,""]
[null,null,null,null,null,null,null,null,0,""]
[null,null,null,null,null,null,null,null,0,""]
[null,null,null,null,null,null,null,null,0,""]
["Other capital transfers [insert description]",null,null,null,null,null,null,null,0,""]
[{"$f":"A20","v":"Provincial Government:"},null,{"$f":"SUM(C53:C58)","v":0},0,0,0,0,0,{"$f":"G52-H52","v":0},{"$f":"IF(I52=0,\"\",I52/H52)","v":""},{"$f":"SUM(K53:K58)","v":0}]
["[insert description]",null,null,null,null,null,null,null,0,{"$f":"IF(I53=0,\"\",I53/H53)","v":""}]
[]
[]
[]
[]
[null,null,null,null,null,null,null,null,0,""]
[{"$f":"A27","v":"District Municipality:"},null,{"$f":"SUM(C60:C61)","v":0},0,0,0,0,0,0,"",{"$f":"SUM(K60:K61)","v":0}]
["[insert description]",null,null,null,null,null,null,null,0,""]
[null,null,null,null,null,null,null,null,0,""]
[{"$f":"A30","v":"Other grant providers:"},null,{"$f":"SUM(C63:C68)","v":0},0,0,0,0,0,0,"",{"$f":"SUM(K63:K68)","v":0}]
["[insert description]",null,null,null,null,null,null,null,0,{"$f":"IF(I63=0,\"\",I63/H63)","v":""}]
[]
[]
[]
[]
[null,null,null,null,null,null,null,null,0,""]
["Total Capital Transfers and Grants",5,{"$f":"C41+C52+C59+C62","v":0},{"$f":"D41+D52+D59+D62","v":60688000},0,24275000,24275000,5057333.333333333,19217666.666666668,3.7999604534669134,60688000]
[]
["TOTAL RECEIPTS OF TRANSFERS & GRANTS",5,{"$f":"C38+C69","v":0},363712000,0,147949000,147949000,30309333.333333332,114931916.66666667,3.7919645213795534,363712000]
[{"$f":"head27a","v":"References"}]
["1. Each grant is listed by name as gazetted together with the name of the transferring department or municipality, donor or other organisation"]
["2. Grant expenditure must be separately listed for each grant received"]
["3. Replacement of RSC levies"]
["4. Housing subsidies for housing where ownership transferred"]
["5. Total recurrent/capital grants and subsidies must reconcile to the 'Financial Performance' Statement"]

{"sheet":"SC7","index":22,"n_rows":50,"n_cols":11,"rows_kept":50,"cut":false,"hidden":false,"merged":[[1,0,2,0],[1,1,2,1],[0,0,0,10]]}
[{"$f":"muni& \" - \"&S71M& \" - \"&Head57","v":"LIM331 Greater Giyani - Supporting Table SC7(1) Monthly Budget Statement - transfers and grant expenditure  - M01 July"}]
[{"$f":"desc","v":"Description"},{"$f":"head27","v":"Ref"},{"$f":"Head1","v":"2018/19"},{"$f":"Head2","v":"Budget Year 2019/20"}]
[null,null,{"$f":"Head5","v":"Audited Outcome"},{"$f":"Head6","v":"Original Budget"},{"$f":"Head7","v":"Adjusted Budget"},{"$f":"Head38","v":"Monthly actual"},{"$f":"Head39","v":"YearTD actual"},{"$f":"Head40","v":"YearTD budget"},{"$f":"Head41","v":"YTD variance"},{"$f":"Head41","v":"YTD variance"},{"$f":"Head8","v":"Full Year Forecast"}]
["R thousands",null,null,null,null,null,null,null,null,"%"]
["EXPENDITURE"]
[]
["Operating expenditure of Transfers and Grants"]
[{"$f":"'SC6'!A8","v":"National Government:"},null,{"$f":"SUM(C9:C15)","v":0},302724000,0,13846326.009999989,13846326.009999989,25227000,-11380673.990000011,{"$f":"IF(I8=0,\"\",I8/H8)","v":-0.45113069290839225},{"$f":"SUM(K9:K15)","v":302724000}]
[{"$f":"'SC6'!A9","v":"Local Government Equitable Share"},null,null,{"$f":"'SC6'!D9","v":287217000},null,13441638.869999988,{"$f":"F9","v":13441638.869999988},{"$f":"1/12*D9","v":23934750},{"$f":"G9-H9","v":-10493111.130000012},-0.4384048770093697,{"$f":"'SC6'!K9","v":287217000}]
[{"$f":"'SC6'!A10","v":"Finance Management "},null,null,{"$f":"'SC6'!D10","v":2145000},null,32762.14,{"$f":"F10","v":32762.14},{"$f":"1/12*D10","v":178750},-145987.85999999999,-0.81671530069930065,{"$f":"'SC6'!K10","v":2145000}]
[{"$f":"'SC6'!A11","v":"Integrated National Electrification Programme"},null,null,{"$f":"'SC6'!D11","v":10000000},null,null,null,{"$f":"1/12*D11","v":833333.33333333326},-833333.33333333326,-1,{"$f":"'SC6'!K11","v":10000000}]
[{"$f":"'SC6'!A12","v":"EPWP Incentive"},null,null,{"$f":"'SC6'!D12","v":3362000},null,371925,{"$f":"F12","v":371925},{"$f":"1/12*D12","v":280166.66666666663},91758.333333333372,0.32751338488994663,{"$f":"'SC6'!K12","v":3362000}]
[{"$f":"'SC6'!A13","v":0},null,null,null,null,null,null,null,0,""]
[{"$f":"'SC6'!A14","v":0},null,null,null,null,null,null,null,0,""]
[{"$f":"'SC6'!A19","v":0},null,null,null,null,null,null,null,0,""]
[{"$f":"'SC6'!A20","v":"Provincial Government:"},null,{"$f":"SUM(C17:C21)","v":0},300000,0,0,0,25000,-25000,-1,{"$f":"SUM(K17:K21)","v":300000}]
[{"$f":"'SC6'!A21","v":0},null,null,null,null,null,null,null,{"$f":"G17-H17","v":0},""]
[{"$f":"'SC6'!A23","v":0},null,null,null,null,null,null,null,0,""]
[{"$f":"'SC6'!A24","v":0},null,null,null,null,null,null,null,0,""]
[{"$f":"'SC6'!A25","v":0},null,null,null,null,null,null,null,0,""]
[{"$f":"'SC6'!A26","v":"LG SETA"},null,null,{"$f":"'SC6'!D26","v":300000},null,null,null,{"$f":"1/12*D21","v":25000},-25000,-1,{"$f":"'SC6'!K26","v":300000}]
[{"$f":"'SC6'!A27","v":"District Municipality:"},null,{"$f":"SUM(C23:C24)","v":0},0,{"$f":"SUM(E23:E24)","v":0},0,0,0,0,"",{"$f":"SUM(K23:K24)","v":0}]
[null,null,null,null,null,null,null,null,0,""]
[{"$f":"'SC6'!A28","v":"[insert description]"},null,null,null,null,null,null,null,0,""]
[{"$f":"'SC6'!A30","v":"Other grant providers:"},null,{"$f":"SUM(C26:C27)","v":0},0,0,0,0,0,0,"",{"$f":"SUM(K26:K27)","v":0}]
[null,null,null,null,null,null,null,null,0,""]
[{"$f":"'SC6'!A31","v":"[insert description]"},null,null,null,null,null,null,null,0,""]
["Total operating expenditure of Transfers and Grants:",null,{"$f":"C8+C16+C22+C25","v":0},{"$f":"D8+D16+D22+D25","v":303024000},0,13846326.009999989,13846326.009999989,25252000,-11405673.990000011,-0.45167408482496479,{"$f":"K8+K16+K22+K25","v":303024000}]
[]
["Capital expenditure of Transfers and Grants"]
[{"$f":"'SC6'!A41","v":"National Government:"},null,{"$f":"SUM(C32:C37)","v":0},60688000,0,312174.54000000004,312174.54000000004,5057333.333333333,-4745158.793333333,{"$f":"IF(I31=0,\"\",I31/H31)","v":-0.93827289612443976},60688000]
[{"$f":"'SC6'!A42","v":"Municipal Infrastructure Grant (MIG)"},null,null,{"$f":"'SC6'!D42","v":60688000},null,312174.54000000004,{"$f":"F32","v":312174.54000000004},{"$f":"1/12*D32","v":5057333.333333333},{"$f":"G32-H32","v":-4745158.793333333},-0.93827289612443976,{"$f":"'SC6'!K42","v":60688000}]
[{"$f":"'SC6'!A47","v":0},null,null,null,null,null,null,null,0,""]
[{"$f":"'SC6'!A48","v":0},null,null,null,null,null,null,null,0,""]
[{"$f":"'SC6'!A49","v":0},null,null,null,null,null,null,null,0,""]
[{"$f":"'SC6'!A50","v":0},null,null,null,null,null,null,null,0,""]
[{"$f":"'SC6'!A51","v":"Other capital transfers [insert description]"},null,null,null,null,null,null,null,0,""]
[{"$f":"'SC6'!A52","v":"Provincial Government:"},null,{"$f":"SUM(C39:C40)","v":0},0,0,0,0,0,{"$f":"G38-H38","v":0},"",{"$f":"SUM(K39:K40)","v":0}]
[null,null,null,null,null,null,null,null,0,""]
[{"$f":"'SC6'!A58","v":0},null,null,null,null,null,null,null,0,""]
[{"$f":"'SC6'!A59","v":"District Municipality:"},null,{"$f":"SUM(C42:C43)","v":0},0,0,0,0,0,0,"",{"$f":"SUM(K42:K43)","v":0}]
[null,null,null,null,null,null,null,null,0,""]
[{"$f":"'SC6'!A61","v":0},null,null,null,null,null,null,null,0,""]
[{"$f":"'SC6'!A62","v":"Other grant providers:"},null,{"$f":"SUM(C45:C46)","v":0},0,0,0,0,0,0,"",{"$f":"SUM(K45:K46)","v":0}]
[null,null,null,null,null,null,null,null,0,""]
[{"$f":"'SC6'!A68","v":0},null,null,null,null,null,null,null,0,""]
["Total capital expenditure of Transfers and Grants",null,{"$f":"C31+C38+C41+C44","v":0},{"$f":"D31+D38+D41+D44","v":60688000},0,312174.54000000004,312174.54000000004,5057333.333333333,-4745158.793333333,{"$f":"IF(I47=0,\"\",I47/H47)","v":-0.93827289612443976},60688000]
[]
["TOTAL EXPENDITURE OF TRANSFERS AND GRANTS",null,{"$f":"C28+C47","v":0},363712000,0,14158500.54999999,14158500.54999999,30309333.333333332,-16150832.783333344,{"$f":"IF(I49=0,\"\",I49/H49)","v":-0.53286664558771812},363712000]
[{"$f":"head27a","v":"References"}]

{"sheet":"SC8","index":23,"n_rows":116,"n_cols":11,"rows_kept":116,"cut":false,"hidden":false,"merged":[[1,0,2,0],[1,1,2,1],[0,0,0,10]]}
[{"$f":"muni& \" - \"&S71N& \" - \"&Head57","v":"LIM331 Greater Giyani - Supporting Table SC8 Monthly Budget Statement - councillor and staff benefits  - M01 July"}]
["Summary of Employee and Councillor remuneration",{"$f":"head27","v":"Ref"},{"$f":"Head1","v":"2018/19"},{"$f":"Head2","v":"Budget Year 2019/20"}]
[null,null,{"$f":"Head5","v":"Audited Outcome"},{"$f":"Head6","v":"Original Budget"},{"$f":"Head7","v":"Adjusted Budget"},{"$f":"Head38","v":"Monthly actual"},{"$f":"Head39","v":"YearTD actual"},{"$f":"Head40","v":"YearTD budget"},{"$f":"Head41","v":"YTD variance"},{"$f":"Head41","v":"YTD variance"},{"$f":"Head8","v":"Full Year Forecast"}]
["R thousands",null,null,null,null,null,null,null,null,"%"]
[null,1,"A","B","C",null,null,null,null,null,"D"]
["Councillors (Political Office Bearers plus Other)"]
["Basic Salaries and Wages",null,15122111.450000001,16322826.489999998,0,1239337.68,{"$f":"F7","v":1239337.68},{"$f":"1/12*D7","v":1360235.540833333},{"$f":"G7-H7","v":-120897.86083333311},{"$f":"IF(I7=0,\"\",I7/H7)","v":-8.8880092604598754E-2},16322826.489999998]
["Pension and UIF Contributions",null,0,0,0,0,0,0,0,"",0]
["Medical Aid Contributions",null,0,0,0,0,0,0,0,"",0]
["Motor Vehicle Allowance",null,4898660.67,4846925.88,0,412850.99,{"$f":"F10","v":412850.99},403910.49,{"$f":"G10-H10","v":8940.5},{"$f":"IF(I10=0,\"\",I10/H10)","v":2.2134854680303056E-2},4846925.88]
["Cellphone Allowance",null,2734300,2752800,0,225700,{"$f":"F11","v":225700},229400,{"$f":"G11-H11","v":-3700},{"$f":"IF(I11=0,\"\",I11/H11)","v":-1.6129032258064516E-2},2752800]
["Housing Allowances",null,0,0,0,0,0,0,{"$f":"G12-H12","v":0},{"$f":"IF(I12=0,\"\",I12/H12)","v":""},0]
["Other benefits and allowances",null,0,0,0,0,0,0,0,"",0]
["Sub Total - Councillors",null,{"$f":"SUM(C7:C13)","v":22755072.120000001},23922552.369999997,0,1877888.67,1877888.67,1993546.030833333,-115657.36083333311,-5.8015896821297146E-2,23922552.369999997]
["% increase",4,null,{"$f":"IF(D14=0,\"\",(D14/C14)-1)","v":5.130637441372321E-2},{"$f":"IF(E14=0,\"\",(E14/C14)-1)","v":""},null,null,null,null,null,{"$f":"IF(K14=0,\"\",(K14/C14)-1)","v":5.130637441372321E-2}]
[]
["Senior Managers of the Municipality",3]
["Basic Salaries and Wages",null,2764108.5100000002,4511185.97,0,221319.51,221319.51,{"$f":"1/12*D18","v":375932.16416666663},{"$f":"G18-H18","v":-154612.65416666662},{"$f":"IF(I18=0,\"\",I18/H18)","v":-0.41127806797111482},4511185.97]
["Pension and UIF Contributions",null,135091.28000000003,180245.55999999994,0,10701.739999999998,10701.739999999998,15020.463333333328,-4318.7233333333297,-0.287522644108404,180245.55999999994]
["Medical Aid Contributions",null,13944,45372,0,0,0,3781,-3781,-1,45372]
["Overtime",null,0,0,0,0,0,0,0,"",0]
["Performance Bonus",null,0,0,0,0,0,0,{"$f":"G22-H22","v":0},{"$f":"IF(I22=0,\"\",I22/H22)","v":""},0]
["Motor Vehicle Allowance",null,768005.39999999991,1531916.9300000002,0,56010.260000000009,56010.260000000009,127659.74416666667,{"$f":"G23-H23","v":-71649.484166666662},{"$f":"IF(I23=0,\"\",I23/H23)","v":-0.56125354656143134},1531916.9300000002]
["Cellphone Allowance",null,39200,95200,0,4200,4200,7933.333333333333,{"$f":"G24-H24","v":-3733.333333333333},{"$f":"IF(I24=0,\"\",I24/H24)","v":-0.47058823529411764},95200]
["Housing Allowances",null,0,0,0,0,0,0,{"$f":"G25-H25","v":0},{"$f":"IF(I25=0,\"\",I25/H25)","v":""},0]
["Other benefits and allowances",null,136481.24,225976.24,0,10709.94,10709.94,18831.353333333333,-8121.413333333332,-0.43127082741088174,225976.24]
["Payments in lieu of leave",null,200277.12,0,0,0,0,0,0,"",0]
["Long service awards",null,0,0,0,0,0,0,0,"",0]
["Post-retirement benefit obligations",2,0,0,0,0,0,0,0,"",0]
["Sub Total - Senior Managers of Municipality",null,{"$f":"SUM(C18:C29)","v":4057107.55},6589896.6999999993,0,{"$f":"SUM(F18:F29)","v":302941.45},{"$f":"SUM(G18:G29)","v":302941.45},{"$f":"SUM(H18:H29)","v":549158.05833333335},-246216.60833333334,{"$f":"IF(I30=0,\"\",I30/H30)","v":-0.44835290058492117},6589896.6999999993]
["% increase",4,null,{"$f":"IF(D30=0,\"\",(D30/C30)-1)","v":0.62428444865850286},{"$f":"IF(E30=0,\"\",(E30/C30)-1)","v":""},null,null,null,null,null,{"$f":"IF(K30=0,\"\",(K30/C30)-1)","v":0.62428444865850286}]
[]
["Other Municipal Staff"]
["Basic Salaries and Wages",null,81621602.539999992,106001907.89,0,7119514.4800000014,7119514.4800000014,{"$f":"1/12*D34","v":8833492.3241666667},{"$f":"G34-H34","v":-1713977.8441666653},{"$f":"IF(I34=0,\"\",I34/H34)","v":-0.19403173527162809},106001907.89]
["Pension and UIF Contributions",null,14924930.08,21531186.149999999,0,1293521.2800000005,1293521.2800000005,1794265.5124999997,-500744.23249999923,-0.27908034179528896,21531186.149999999]
["Medical Aid Contributions",null,3815018.5100000007,4156940.64,0,348946.2,348946.2,346411.72,2534.4800000000396,7.3163806351587641E-3,4156940.64]
["Overtime",null,5827399.1099999994,3962359,0,556822.45000000007,556822.45000000007,330196.58333333331,226625.86666666676,0.68633619518069944,3962359]
["Performance Bonus",null,0,0,0,0,0,0,0,"",0]
["Motor Vehicle Allowance",null,8930861.5099999979,11659652.4,0,816776.53999999992,816776.53999999992,971637.7,{"$f":"G39-H39","v":-154861.16000000003},{"$f":"IF(I39=0,\"\",I39/H39)","v":-0.15938158842539771},11659652.4]
["Cellphone Allowance",null,448760,802752,0,55705.89,55705.89,66896,{"$f":"G40-H40","v":-11190.11},{"$f":"IF(I40=0,\"\",I40/H40)","v":-0.16727621980387469},802752]
["Housing Allowances",null,273618.89,283224.24,0,23602.020000000004,23602.020000000004,23602.019999999997,{"$f":"G41-H41","v":0},{"$f":"IF(I41=0,\"\",I41/H41)","v":""},283224.24]
["Other benefits and allowances",null,6956123.0700000003,9285715.9500000011,0,487087.26999999996,487087.26999999996,773809.66250000009,-286722.39250000013,-0.3705334869736136,9285715.9500000011]
["Payments in lieu of leave",null,1244478.45,0,0,0,0,0,0,"",0]
["Long service awards",null,2374494.3600000003,263657.14,0,0,0,21971.428333333333,-21971.428333333333,-1,263657.14]
["Post-retirement benefit obligations",2,0,13727.73,0,0,0,1143.9775,-1143.9775,-1,13727.73]
["Sub Total - Other Municipal Staff",null,{"$f":"SUM(C34:C45)","v":126417286.52000001},157961123.13999999,0,{"$f":"SUM(F34:F45)","v":10701976.129999999},{"$f":"SUM(G34:G45)","v":10701976.129999999},{"$f":"SUM(H34:H45)","v":13163426.928333331},-2461450.7983333319,{"$f":"IF(I46=0,\"\",I46/H46)","v":-0.18699164068250615},157961123.13999999]
["% increase",4,null,{"$f":"IF(D46=0,\"\",(D46/C46)-1)","v":0.24952154478501276},{"$f":"IF(E46=0,\"\",(E46/C46)-1)","v":""},null,null,null,null,null,{"$f":"IF(K46=0,\"\",(K46/C46)-1)","v":0.24952154478501276}]
[]
["Total Parent Municipality",null,{"$f":"C14+C30+C46","v":153229466.19},{"$f":"D14+D30+D46","v":188473572.20999998},0,12882806.25,12882806.25,15706131.017499998,{"$f":"G49-H49","v":-2823324.7674999982},{"$f":"IF(I49=0,\"\",I49/H49)","v":-0.17975940505998639},188473572.20999998]
[null,null,null,{"$f":"IF(D49=0,\"\",(D49/C49)-1)","v":0.23000867193714769},{"$f":"IF(E49=0,\"\",(E49/C49)-1)","v":""},null,null,null,null,null,{"$f":"IF(K49=0,\"\",(K49/C49)-1)","v":0.23000867193714769}]
["Unpaid salary, allowances & benefits in arrears:"]
[]
["Board Members of Entities"]
["Basic Salaries and Wages",null,0,0,0,0,0,0,{"$f":"G54-H54","v":0},{"$f":"IF(I54=0,\"\",I54/H54)","v":""},0]
["Pension and UIF Contributions",null,0,0,0,0,0,0,0,"",0]
["Medical Aid Contributions",null,0,0,0,0,0,0,0,"",0]
["Overtime",null,0,0,0,0,0,0,{"$f":"G57-H57","v":0},{"$f":"IF(I57=0,\"\",I57/H57)","v":""},0]
["Performance Bonus",null,0,0,0,0,0,0,{"$f":"G58-H58","v":0},{"$f":"IF(I58=0,\"\",I58/H58)","v":""},0]
["Motor Vehicle Allowance",null,0,0,0,0,0,0,{"$f":"G59-H59","v":0},{"$f":"IF(I59=0,\"\",I59/H59)","v":""},0]
["Cellphone Allowance",null,0,0,0,0,0,0,{"$f":"G60-H60","v":0},{"$f":"IF(I60=0,\"\",I60/H60)","v":""},0]
["Housing Allowances",null,0,0,0,0,0,0,{"$f":"G61-H61","v":0},{"$f":"IF(I61=0,\"\",I61/H61)","v":""},0]
["Other benefits and allowances",null,0,0,0,0,0,0,0,"",0]
["Board Fees",null,0,0,0,0,0,0,{"$f":"G63-H63","v":0},{"$f":"IF(I63=0,\"\",I63/H63)","v":""},0]
["Payments in lieu of leave",null,0,0,0,0,0,0,0,"",0]
["Long service awards",null,0,0,0,0,0,0,0,"",0]
["Post-retirement benefit obligations",null,0,0,0,0,0,0,0,"",0]
["Sub Total - Board Members of Entities",2,{"$f":"SUM(C54:C66)","v":0},0,0,{"$f":"SUM(F54:F66)","v":0},{"$f":"SUM(G54:G66)","v":0},{"$f":"SUM(H54:H66)","v":0},0,{"$f":"IF(I67=0,\"\",I67/H67)","v":""},0]
["% increase",4,null,{"$f":"IF(D67=0,\"\",(D67/C67)-1)","v":""},{"$f":"IF(E67=0,\"\",(E67/C67)-1)","v":""},null,null,null,null,null,{"$f":"IF(K67=0,\"\",(K67/C67)-1)","v":""}]
[]
["Senior Managers of Entities"]
["Basic Salaries and Wages",null,0,0,0,0,0,0,{"$f":"G71-H71","v":0},{"$f":"IF(I71=0,\"\",I71/H71)","v":""},0]
["Pension and UIF Contributions",null,0,0,0,0,0,0,0,"",0]
["Medical Aid Contributions",null,0,0,0,0,0,0,0,"",0]
["Overtime",null,0,0,0,0,0,0,0,"",0]
["Performance Bonus",null,0,0,0,0,0,0,{"$f":"G75-H75","v":0},{"$f":"IF(I75=0,\"\",I75/H75)","v":""},0]
["Motor Vehicle Allowance",null,0,0,0,0,0,0,{"$f":"G76-H76","v":0},{"$f":"IF(I76=0,\"\",I76/H76)","v":""},0]
["Cellphone Allowance",null,0,0,0,0,0,0,{"$f":"G77-H77","v":0},{"$f":"IF(I77=0,\"\",I77/H77)","v":""},0]
["Housing Allowances",null,0,0,0,0,0,0,{"$f":"G78-H78","v":0},{"$f":"IF(I78=0,\"\",I78/H78)","v":""},0]
["Other benefits and allowances",null,0,0,0,0,0,0,0,"",0]
["Payments in lieu of leave",null,0,0,0,0,0,0,0,"",0]
["Long service awards",null,0,0,0,0,0,0,0,"",0]
["Post-retirement benefit obligations",2,0,0,0,0,0,0,0,"",0]
["Sub Total - Senior Managers of Entities",null,{"$f":"SUM(C71:C82)","v":0},0,0,{"$f":"SUM(F71:F82)","v":0},{"$f":"SUM(G71:G82)","v":0},{"$f":"SUM(H71:H82)","v":0},0,{"$f":"IF(I83=0,\"\",I83/H83)","v":""},0]
["% increase",4,null,{"$f":"IF(D83=0,\"\",(D83/C83)-1)","v":""},{"$f":"IF(E83=0,\"\",(E83/C83)-1)","v":""},null,null,null,null,null,{"$f":"IF(K83=0,\"\",(K83/C83)-1)","v":""}]
[]
["Other Staff of Entities"]
["Basic Salaries and Wages",null,0,0,0,0,0,0,{"$f":"G87-H87","v":0},{"$f":"IF(I87=0,\"\",I87/H87)","v":""},0]
["Pension and UIF Contributions",null,0,0,0,0,0,0,0,"",0]
["Medical Aid Contributions",null,0,0,0,0,0,0,{"$f":"G89-H89","v":0},{"$f":"IF(I89=0,\"\",I89/H89)","v":""},0]
["Overtime",null,0,0,0,0,0,0,{"$f":"G90-H90","v":0},{"$f":"IF(I90=0,\"\",I90/H90)","v":""},0]
["Performance Bonus",null,0,0,0,0,0,0,{"$f":"G91-H91","v":0},{"$f":"IF(I91=0,\"\",I91/H91)","v":""},0]
["Motor Vehicle Allowance",null,0,0,0,0,0,0,{"$f":"G92-H92","v":0},{"$f":"IF(I92=0,\"\",I92/H92)","v":""},0]
["Cellphone Allowance",null,0,0,0,0,0,0,0,"",0]
["Housing Allowances",null,0,0,0,0,0,0,0,"",0]
["Other benefits and allowances",null,0,0,0,0,0,0,0,"",0]
["Payments in lieu of leave",null,0,0,0,0,0,0,0,"",0]
["Long service awards",null,0,0,0,0,0,0,0,"",0]
["Post-retirement benefit obligations",null,0,0,0,0,0,0,0,"",0]
["Sub Total - Other Staff of Entities",null,{"$f":"SUM(C87:C98)","v":0},0,0,0,0,0,0,{"$f":"IF(I99=0,\"\",I99/H99)","v":""},{"$f":"SUM(K87:K98)","v":0}]
["% increase",4,null,{"$f":"IF(D99=0,\"\",(D99/C99)-1)","v":""},{"$f":"IF(E99=0,\"\",(E99/C99)-1)","v":""},null,null,null,null,null,{"$f":"IF(K99=0,\"\",(K99/C99)-1)","v":""}]
[]
["Total Municipal Entities",null,{"$f":"C67+C83+C99","v":0},0,0,0,0,0,{"$f":"G102-H102","v":0},{"$f":"IF(I102=0,\"\",I102/H102)","v":""},{"$f":"K67+K83+K99","v":0}]
[]
["TOTAL SALARY, ALLOWANCES & BENEFITS",null,{"$f":"C49+C102","v":153229466.19},188473572.20999998,0,12882806.25,12882806.25,15706131.017499998,{"$f":"G104-H104","v":-2823324.7674999982},{"$f":"IF(I104=0,\"\",I104/H104)","v":-0.17975940505998639},{"$f":"K49+K102","v":188473572.20999998}]
["% increase",4,null,{"$f":"IF(D104=0,\"\",(D104/C104)-1)","v":0.23000867193714769},{"$f":"IF(E104=0,\"\",(E104/C104)-1)","v":""},null,null,null,null,null,{"$f":"IF(K104=0,\"\",(K104/C104)-1)","v":0.23000867193714769}]
["TOTAL MANAGERS AND STAFF",null,{"$f":"C30+C46+C83+C99","v":130474394.07000001},164551019.83999997,0,11004917.579999998,11004917.579999998,13712584.986666664,-2707667.4066666653,{"$f":"IF(I106=0,\"\",I106/H106)","v":-0.19745856884748184},{"$f":"K30+K46+K83+K99","v":164551019.83999997}]
[{"$f":"head27a","v":"References"}]
["1. Include 'Loans and advances' where applicable if any reportable amounts until phased compliance with s164 of MFMA achieved"]
["2. If benefits in kind are provided (e.g. provision of living quarters) the full market value must be shown as the cost to the municipality"]
["3. s57 of the Systems Act"]
["4. B/A, C/A, D/A"]
["Column Definitions:"]
["A. Audited actual 2005/06 (audited financial statements). If audited amounts unavailable, unaudited amounts must be provided with a note stating these are unaudited"]
["B. The original budget approved by council for the 2006/07 budget year."]
["C. The budget for 2006/07 budget year as adjusted by council resolution in terms of section 28 of the MFMA."]
["D. An estimate of final actual amounts (pre audit - 2006/07 budget year) at the time of preparing the budget for the 2007/08 budget year. This may differ from C."]

{"sheet":"SC9","index":24,"n_rows":66,"n_cols":17,"rows_kept":66,"cut":false,"hidden":false,"merged":[[2,15,3,15],[2,16,3,16],[1,0,2,0],[2,14,3,14],[1,1,2,1],[1,2,1,13],[1,14,1,16]]}
[{"$f":"muni& \" - \"&S71O& \" - \"&Head57","v":"LIM331 Greater Giyani - Supporting Table SC9 Monthly Budget Statement - actuals and revised targets for cash receipts - M01 July"}]
[{"$f":"desc","v":"Description"},{"$f":"head27","v":"Ref"},{"$f":"Head2","v":"Budget Year 2019/20"},null,null,null,null,null,null,null,null,null,null,null,{"$f":"'Template names'!B5","v":"2019/20 Medium Term Revenue & Expenditure Framework"}]
[null,null,"July","August","Sept","October","Nov","Dec","January","Feb","March","April","May","June",{"$f":"Head9","v":"Budget Year 2019/20"},{"$f":"Head10","v":"Budget Year +1 2020/21"},{"$f":"Head11","v":"Budget Year +2 2021/22"}]
["R thousands",1,"Outcome","Outcome","Outcome","Outcome","Outcome","Outcome","Budget","Budget","Budget","Budget","Budget","Budget"]
["Cash Receipts By Source"]
["Property rates",null,761285,3381333.33,3381333.33,3381333.33,3381333.33,3381333.33,3381333.33,3381333.33,3381333.33,3381333.33,3381333.33,{"$f":"O6-SUM(C6:M6)","v":-10589018.29999999},23985600,25280824,26645986]
["Service charges - electricity revenue",null,null,0,0,0,0,0,0,0,0,0,0,0,0]
["Service charges - water revenue",null,null,0,0,0,0,0,0,0,0,0,0,0,0]
["Service charges - sanitation revenue",null,null,0,0,0,0,0,0,0,0,0,0,0,0]
["Service charges - refuse",null,184972,450000,450000,450000,450000,450000,450000,450000,450000,450000,450000,-1444972,3240000,3270000,3270000]
[]
["Rental of facilities and equipment",null,{"$f":"80011+18291-62450","v":35852},101833.33,101833.33,101833.33,101833.33,101833.33,101833.33,101833.33,101833.33,101833.33,101833.33,167814.70000000019,1222000,1242100,1267222]
["Interest earned - external investments",null,321171.17,416666.67,416666.67,416666.67,416666.67,416666.67,416666.67,416666.67,416666.67,416666.67,416666.67,512162.12999999989,5000000,5100000,5150000]
["Interest earned - outstanding debtors",null,null,283333.33,283333.33,283333.33,283333.33,283333.33,283333.33,283333.33,283333.33,283333.33,283333.33,566666.69999999972,3400000,3583600,3777133]
["Dividends received",null,null,0,0,0,0,0,0,0,0,0,0,0,0]
["Fines, penalties and forfeits",null,126940,833333.33,833333.33,833333.33,833333.33,833333.33,833333.33,833333.33,833333.33,833333.33,833333.33,1539726.7000000011,10000000,11000000,11000000]
["Licences and permits",null,1684160.5,458333.33,458333.33,458333.33,458333.33,458333.33,458333.33,458333.33,458333.33,458333.33,458333.33,-767493.80000000075,5500000,5600000,5600000]
["Agency services",null,null,0,0,0,0,0,0,0,0,0,0,0,0]
["Transfer receipts - operating",null,123674000,24460333.329999998,24460333.329999998,24460333.329999998,24460333.329999998,24460333.329999998,24460333.329999998,24460333.329999998,24460333.329999998,24460333.329999998,24460333.329999998,-65253333.299999833,303024000,316807000,345521000]
["Other revenue",null,145117.67000000001,145916.67000000001,145916.67000000001,145916.67000000001,145916.67000000001,145916.67000000001,145916.67000000001,145916.67000000001,145916.67000000001,145916.67000000001,145916.67000000001,146715.63000000012,1751000,1847780,1944026.12]
["Cash Receipts by Source",null,{"$f":"SUM(C6:C10)+SUM(C12:C20)","v":126933498.34},{"$f":"SUM(D6:D10)+SUM(D12:D20)","v":30531083.32},30531083.32,30531083.32,30531083.32,30531083.32,30531083.32,30531083.32,30531083.32,30531083.32,30531083.32,-75121731.539999813,357122600,373731304,404175367.12]
[null,null,null,null,null,null,null,null,null,null,null,null,null,{"$f":"O22-SUM(C22:M22)","v":0}]
["Other Cash Flows by Source",null,null,null,null,null,null,null,null,null,null,null,null,0]
["Transfer receipts - capital",null,24275000,5890666.6699999999,5890666.6699999999,5890666.6699999999,5890666.6699999999,5890666.6699999999,5890666.6699999999,5890666.6699999999,5890666.6699999999,5890666.6699999999,5890666.6699999999,-22493666.700000018,60688000,64049000,68884000]
["Contributions & Contributed assets",null,0,0,0,0,0,0,0,0,0,0,0,0,0]
["Proceeds on disposal of PPE",null,0,0,0,0,0,0,0,0,0,0,0,0,0]
["Short term loans",null,0,0,0,0,0,0,0,0,0,0,0,0,0]
["Borrowing long term/refinancing",null,0,0,0,0,0,0,0,0,0,0,0,0,0]
["Increase in consumer deposits",null,0,0,0,0,0,0,0,0,0,0,0,0,0]
["Receipt of non-current debtors",null,0,0,0,0,0,0,0,0,0,0,0,0,0]
["Receipt of non-current receivables",null,0,0,0,0,0,0,0,0,0,0,0,0,0]
["Change in non-current investments",null,0,0,0,0,0,0,0,0,0,0,0,0,0]
["Total Cash Receipts by Source",null,{"$f":"SUM(C21:C32)","v":151208498.34},36421749.990000002,36421749.990000002,36421749.990000002,36421749.990000002,36421749.990000002,36421749.990000002,36421749.990000002,36421749.990000002,36421749.990000002,36421749.990000002,-97615398.239999831,417810600,437780304,473059367.12]
[null,null,null,null,null,null,null,null,null,null,null,null,null,{"$f":"O34-SUM(C34:M34)","v":0}]
["Cash Payments by Type",null,null,null,null,null,null,null,null,null,null,null,null,0]
["Employee related costs",null,11004917.579999985,13712584.99,13712584.99,13712584.99,13712584.99,13712584.99,13712584.99,13712584.99,13712584.99,13712584.99,13712584.99,16420252.360000134,164551019.84000012,180024262.83999991,193364520.76000005]
["Remuneration of councillors",null,1877888.67,1993546.03,1993546.03,1993546.03,1993546.03,1993546.03,1993546.03,1993546.03,1993546.03,1993546.03,1993546.03,2109203.3999999985,23922552.370000001,25513402.090000004,27210043.340000004]
["Interest paid",null,null,0,0,0,0,0,0,0,0,0,0,0,0]
["Bulk purchases - Electricity",null,null,0,0,0,0,0,0,0,0,0,0,0,0]
["Bulk purchases - Water & Sewer",null,null,0,0,0,0,0,0,0,0,0,0,0,0]
["Other materials",null,391859.10000000003,750000,750000,750000,750000,750000,750000,750000,750000,750000,750000,1108140.9000000004,9000000,12000000,14790000]
["Contracted services",null,293832.76,5936500.6699999999,5936500.6699999999,5936500.6699999999,5936500.6699999999,5936500.6699999999,5936500.6699999999,5936500.6699999999,5936500.6699999999,5936500.6699999999,5936500.6699999999,11579168.539999992,71238008,61042513,69404708]
["Grants and subsidies paid - other municipalities",null,null,0,0,0,0,0,0,0,0,0,0,0,0]
["Grants and subsidies paid - other",null,null,0,0,0,0,0,0,0,0,0,0,0]
["General expenses",null,1085000.4400000002,4706596.5999999996,4706596.5999999996,4706596.5999999996,4706596.5999999996,4706596.5999999996,4706596.5999999996,4706596.5999999996,4706596.5999999996,4706596.5999999996,4706596.5999999996,9328192.7899999917,57479159.229999997,63629920.020000003,70239835.209999993]
["Cash Payments by Type",{"$f":"SUM(B36:B45)","v":0},{"$f":"SUM(C36:C45)","v":14653498.549999984},{"$f":"SUM(D36:D45)","v":27099228.289999999},27099228.289999999,27099228.289999999,27099228.289999999,27099228.289999999,27099228.289999999,27099228.289999999,27099228.289999999,27099228.289999999,27099228.289999999,40544957.990000114,326190739.44000018,342210097.94999993,375009107.31]
[null,null,null,null,null,null,null,null,null,null,null,null,null,{"$f":"O47-SUM(C47:M47)","v":0}]
["Other Cash Flows/Payments by Type"]
["Capital assets",null,null,9155855.5,9155855.5,9155855.5,9155855.5,9155855.5,9155855.5,9155855.5,9155855.5,9155855.5,9155855.5,{"$f":"O49-SUM(C49:M49)","v":18311711},109870266,95759088,94205350]
["Repayment of borrowing",null,0,0,0,0,0,0,0,0,0,0,0,{"$f":"O50-SUM(C50:M50)","v":0},0]
["Other Cash Flows/Payments",null,4977903.07,0,0,0,0,0,0,0,0,0,0,{"$f":"O51-SUM(C51:M51)","v":-4977903.07},0]
["Total Cash Payments by Type",{"$f":"SUM(B46:B51)","v":0},19631401.619999982,36255083.789999999,36255083.789999999,36255083.789999999,36255083.789999999,36255083.789999999,36255083.789999999,36255083.789999999,36255083.789999999,36255083.789999999,36255083.789999999,53878765.920000114,436061005.44000018,437969185.94999993,469214457.31]
[null,null,null,null,null,null,null,null,null,null,null,null,null,{"$f":"O53-SUM(C53:M53)","v":0}]
["NET INCREASE/(DECREASE) IN CASH HELD",{"$f":"B33-B52","v":0},131577096.72000003,166666.20000000298,166666.20000000298,166666.20000000298,166666.20000000298,166666.20000000298,166666.20000000298,166666.20000000298,166666.20000000298,166666.20000000298,166666.20000000298,-151494164.15999994,-18250405.440000176,-188881.94999992847,3844909.8100000024]
["Cash/cash equivalents at the month/year beginning:",null,40759300,{"$f":"C56","v":172336396.72000003},{"$f":"D56","v":172503062.92000002},172669729.12,172836395.31999999,173003061.51999998,173169727.71999997,173336393.91999996,173503060.11999995,173669726.31999993,173836392.51999992,174003058.71999991,{"$f":"C55","v":40759300},{"$f":"O56","v":22508894.559999824},{"$f":"P56","v":22320012.609999895}]
["Cash/cash equivalents at the month/year end:",null,{"$f":"C54+C55","v":172336396.72000003},{"$f":"D54+D55","v":172503062.92000002},{"$f":"E54+E55","v":172669729.12},172836395.31999999,173003061.51999998,173169727.71999997,173336393.91999996,173503060.11999995,173669726.31999993,173836392.51999992,174003058.71999991,22508894.559999973,{"$f":"O54+O55","v":22508894.559999824},{"$f":"P54+P55","v":22320012.609999895},{"$f":"Q54+Q55","v":26164922.419999897}]
[{"$f":"head27a","v":"References"}]
["1. Replace 'budget' heading with adjusted budget, or 'outcome' only for month/s complete"]
["2. Total of monthly amounts must always agree to the approved or adjusted budget"]
["3. Amend 'cash-at-beginning' when prior year actual known (as part of the adjustments budget)"]
[]
[]
[]
[]
[null,null,null,null,{"$f":"E46+E64","v":27099228.289999999},27099228.289999999,27099228.289999999,27099228.289999999,27099228.289999999,27099228.289999999,27099228.289999999,27099228.289999999,null,{"$f":"N46+N64","v":40544957.990000114},326190739.44000018,342210097.94999993]
[null,null,null,null,{"$f":"E54-E64","v":166666.20000000298},166666.20000000298,166666.20000000298,166666.20000000298,166666.20000000298,166666.20000000298,166666.20000000298,166666.20000000298,{"$f":"M54-M64","v":166666.20000000298},{"$f":"N54-N64","v":-151494164.15999994},-18250405.440000176,-188881.94999992847]

{"sheet":"SC10","index":25,"n_rows":46,"n_cols":11,"rows_kept":46,"cut":false,"hidden":false,"merged":[[1,0,2,0],[1,1,2,1],[0,0,0,10]]}
[{"$f":"muni& \" - \"&S71P& \" - \"&Head57","v":"LIM331 Greater Giyani - NOT REQUIRED - municipality does not have entities or this is the parent municipality's budget - M01 July"}]
[{"$f":"desc","v":"Description"},{"$f":"head27","v":"Ref"},{"$f":"Head1","v":"2018/19"},{"$f":"Head2","v":"Budget Year 2019/20"}]
[null,null,{"$f":"Head5","v":"Audited Outcome"},{"$f":"Head6","v":"Original Budget"},{"$f":"Head7","v":"Adjusted Budget"},{"$f":"Head38","v":"Monthly actual"},{"$f":"Head39","v":"YearTD actual"},{"$f":"Head40","v":"YearTD budget"},{"$f":"Head41","v":"YTD variance"},{"$f":"Head41","v":"YTD variance"},{"$f":"Head8","v":"Full Year Forecast"}]
["R thousands",1,null,null,null,null,null,null,null,"%"]
[{"$f":"'C4-FinPerf RE'!A5","v":"Revenue By Source"}]
[{"$f":"'C4-FinPerf RE'!A6","v":"Property rates"},null,null,null,null,null,null,null,{"$f":"G6-H6","v":0},{"$f":"IF(I6=0,\"\",I6/H6)","v":""}]
[{"$f":"'C4-FinPerf RE'!A7","v":"Service charges - electricity revenue"},null,null,null,null,null,null,null,0,{"$f":"IF(I7=0,\"\",I7/H7)","v":""}]
[{"$f":"'C4-FinPerf RE'!A8","v":"Service charges - water revenue"},null,null,null,null,null,null,null,0,""]
[{"$f":"'C4-FinPerf RE'!A9","v":"Service charges - sanitation revenue"},null,null,null,null,null,null,null,0,""]
[{"$f":"'C4-FinPerf RE'!A10","v":"Service charges - refuse revenue"},null,null,null,null,null,null,null,0,""]
[]
[{"$f":"'C4-FinPerf RE'!A12","v":"Rental of facilities and equipment"},null,null,null,null,null,null,null,0,""]
[{"$f":"'C4-FinPerf RE'!A13","v":"Interest earned - external investments"},null,null,null,null,null,null,null,0,""]
[{"$f":"'C4-FinPerf RE'!A14","v":"Interest earned - outstanding debtors"},null,null,null,null,null,null,null,0,""]
[{"$f":"'C4-FinPerf RE'!A15","v":"Dividends received"},null,null,null,null,null,null,null,0,""]
[{"$f":"'C4-FinPerf RE'!A16","v":"Fines, penalties and forfeits"},null,null,null,null,null,null,null,0,""]
[{"$f":"'C4-FinPerf RE'!A17","v":"Licences and permits"},null,null,null,null,null,null,null,0,""]
[{"$f":"'C4-FinPerf RE'!A18","v":"Agency services"},null,null,null,null,null,null,null,0,""]
[{"$f":"'C4-FinPerf RE'!A19","v":"Transfers and subsidies"},null,null,null,null,null,null,null,0,""]
[{"$f":"'C4-FinPerf RE'!A20","v":"Other revenue"},null,null,null,null,null,null,null,0,""]
[{"$f":"'C4-FinPerf RE'!A21","v":"Gains on disposal of PPE"},null,null,null,null,null,null,null,0,""]
["Total Revenue (excluding capital transfers and contributions)",null,{"$f":"SUM(C6:C10)+SUM(C12:C21)","v":0},0,0,0,0,0,{"$f":"G22-H22","v":0},"",{"$f":"SUM(K6:K10)+SUM(K12:K21)","v":0}]
[]
["Expenditure By Type"]
[{"$f":"'C4-FinPerf RE'!A25","v":"Employee related costs"},null,null,null,null,null,null,null,{"$f":"G25-H25","v":0},{"$f":"IF(I25=0,\"\",I25/H25)","v":""}]
[{"$f":"'C4-FinPerf RE'!A26","v":"Remuneration of councillors"},null,null,null,null,null,null,null,0,""]
[{"$f":"'C4-FinPerf RE'!A27","v":"Debt impairment"},null,null,null,null,null,null,null,0,""]
[{"$f":"'C4-FinPerf RE'!A28","v":"Depreciation & asset impairment"},null,null,null,null,null,null,null,0,""]
[{"$f":"'C4-FinPerf RE'!A29","v":"Finance charges"},null,null,null,null,null,null,null,0,""]
[{"$f":"'C4-FinPerf RE'!A30","v":"Bulk purchases"},null,null,null,null,null,null,null,0,""]
[{"$f":"'C4-FinPerf RE'!A31","v":"Other materials"},null,null,null,null,null,null,null,0,""]
[{"$f":"'C4-FinPerf RE'!A32","v":"Contracted services"},null,null,null,null,null,null,null,0,""]
[{"$f":"'C4-FinPerf RE'!A33","v":"Transfers and subsidies"},null,null,null,null,null,null,null,0,""]
[{"$f":"'C4-FinPerf RE'!A34","v":"Other expenditure"},null,null,null,null,null,null,null,0,""]
[{"$f":"'C4-FinPerf RE'!A35","v":"Loss on disposal of PPE"},null,null,null,null,null,null,null,0,""]
["Total Expenditure",null,{"$f":"SUM(C25:C35)","v":0},0,0,0,0,0,0,"",{"$f":"SUM(K25:K35)","v":0}]
[null,null,null,null,null,null,null,null,0]
[{"$f":"'C4-FinPerf RE'!A38","v":"Surplus/(Deficit)"},null,{"$f":"C22-C36","v":0},0,0,0,0,0,0,"",{"$f":"K22-K36","v":0}]
[{"$f":"'C4-FinPerf RE'!A39","v":"Transfers and subsidies - capital (monetary allocations) (National / Provincial and District)"},null,null,null,null,null,null,null,0,""]
[{"$f":"'C4-FinPerf RE'!A40","v":"Transfers and subsidies - capital (monetary allocations) (National / Provincial Departmental Agencies, Households, Non-profit Institutions, Private Enterprises, Public Corporatons, Higher Educational Institutions)"},null,null,null,null,null,null,null,0,""]
[{"$f":"'C4-FinPerf RE'!A41","v":"Transfers and subsidies - capital (in-kind - all) "},null,null,null,null,null,null,null,0,""]
[{"$f":"'C4-FinPerf RE'!A42","v":"Surplus/(Deficit) after capital transfers & contributions"},null,{"$f":"C38+SUM(C39:C41)","v":0},{"$f":"D38+SUM(D39:D41)","v":0},0,0,0,0,0,"",0]
[{"$f":"'C4-FinPerf RE'!A43","v":"Taxation"},null,null,null,null,null,null,null,0,""]
[{"$f":"'C4-FinPerf RE'!A44","v":"Surplus/(Deficit) after taxation"},null,{"$f":"C42-C43","v":0},0,0,0,0,0,0,"",{"$f":"K42-K43","v":0}]
[{"$f":"head27a","v":"References"}]
["1. Votes (consolidated) are revenue sources and expenditure type"]

{"sheet":"SC11","index":26,"n_rows":49,"n_cols":11,"rows_kept":49,"cut":false,"hidden":false,"merged":[[1,0,2,0],[1,1,2,1],[0,0,0,10],[1,3,1,10]]}
[{"$f":"muni& \" - \"&S71Q& \" - \"&Head57","v":"LIM331 Greater Giyani - NOT REQUIRED - municipality does not have entities or this is the parent municipality's budget - M01 July"}]
[{"$f":"desc","v":"Description"},{"$f":"head27","v":"Ref"},{"$f":"Head1","v":"2018/19"},{"$f":"Head2","v":"Budget Year 2019/20"}]
[null,null,{"$f":"Head5","v":"Audited Outcome"},{"$f":"Head6","v":"Original Budget"},{"$f":"Head7","v":"Adjusted Budget"},{"$f":"Head38","v":"Monthly actual"},{"$f":"Head39","v":"YearTD actual"},{"$f":"Head40","v":"YearTD budget"},{"$f":"Head41","v":"YTD variance"},{"$f":"Head41","v":"YTD variance"},{"$f":"Head8","v":"Full Year Forecast"}]
["R thousands",null,null,null,null,null,null,null,null,"%"]
["Revenue By Municipal Entity"]
["Insert name of municipal entity",null,null,null,null,null,null,null,{"$f":"G6-H6","v":0},{"$f":"IF(I6=0,\"\",I6/H6)","v":""}]
[null,null,null,null,null,null,null,null,0,{"$f":"IF(I7=0,\"\",I7/H7)","v":""}]
[null,null,null,null,null,null,null,null,0,""]
[null,null,null,null,null,null,null,null,0,""]
[null,null,null,null,null,null,null,null,0,""]
[null,null,null,null,null,null,null,null,0,""]
[null,null,null,null,null,null,null,null,0,""]
[null,null,null,null,null,null,null,null,0,""]
[null,null,null,null,null,null,null,null,0,""]
[null,null,null,null,null,null,null,null,0,""]
["Total Operating Revenue",1,{"$f":"SUM(C6:C15)","v":0},0,0,0,0,0,0,"",{"$f":"SUM(K6:K15)","v":0}]
[]
["Expenditure By Municipal Entity"]
[{"$f":"A6","v":"Insert name of municipal entity"},null,null,null,null,null,null,null,0,{"$f":"IF(I19=0,\"\",I19/H19)","v":""}]
[{"$f":"IF(A7=\"\",\"\",A7)","v":""},null,null,null,null,null,null,null,0,""]
[{"$f":"IF(A8=\"\",\"\",A8)","v":""},null,null,null,null,null,null,null,0,""]
["",null,null,null,null,null,null,null,0,""]
["",null,null,null,null,null,null,null,0,""]
["",null,null,null,null,null,null,null,0,""]
["",null,null,null,null,null,null,null,0,""]
["",null,null,null,null,null,null,null,0,""]
["",null,null,null,null,null,null,null,0,""]
["",null,null,null,null,null,null,null,0,""]
["Total Operating Expenditure",2,{"$f":"SUM(C19:C28)","v":0},0,0,0,0,0,0,"",{"$f":"SUM(K19:K28)","v":0}]
[null,null,null,null,null,null,null,null,null,""]
[{"$f":"Head42","v":"Surplus/ (Deficit) for the yr/period"},null,{"$f":"C16-C29","v":0},{"$f":"D16-D29","v":0},0,0,0,0,{"$f":"I16+I29","v":0},"",0]
["Capital Expenditure By Municipal Entity"]
[{"$f":"$A$6","v":"Insert name of municipal entity"},null,null,null,null,null,null,null,0,""]
[{"$f":"IF(A7=\"\",\"\",A7)","v":""},null,null,null,null,null,null,null,0,""]
[{"$f":"IF(A8=\"\",\"\",A8)","v":""},null,null,null,null,null,null,null,0,""]
["",null,null,null,null,null,null,null,0,""]
["",null,null,null,null,null,null,null,0,""]
["",null,null,null,null,null,null,null,0,""]
["",null,null,null,null,null,null,null,0,""]
["",null,null,null,null,null,null,null,0,""]
["",null,null,null,null,null,null,null,0,""]
[null,null,null,null,null,null,null,null,null,""]
["Total Capital Expenditure",3,{"$f":"SUM(C32:C42)","v":0},{"$f":"SUM(D32:D42)","v":0},0,0,0,{"$f":"SUM(H32:H42)","v":0},{"$f":"G43-H43","v":0},"",0]
[{"$f":"head27a","v":"References"}]
["1. Must reconcile to the sum of all municipal entity monthly revenue reports"]
["2. Must reconcile to the sum of all municipal entity monthly expenditure reports"]
["3. YTD = Year to date; FAV - favourable variance or unfavourable variance"]
["4. Material variances to be explained"]
["5. Insert additional 'Adjustment' Budget column for each Adjustment made by an entity"]

{"sheet":"SC12","index":27,"n_rows":18,"n_cols":10,"rows_kept":18,"cut":false,"hidden":false,"merged":[[1,0,2,0],[0,0,0,9],[1,2,1,9]]}
[{"$f":"muni& \" - \"&S71R& \" - \"&Head57","v":"LIM331 Greater Giyani - Supporting Table SC12 Monthly Budget Statement - capital expenditure trend - M01 July"}]
["Month",{"$f":"Head1","v":"2018/19"},{"$f":"Head2","v":"Budget Year 2019/20"}]
[null,{"$f":"Head5","v":"Audited Outcome"},{"$f":"Head6","v":"Original Budget"},{"$f":"Head7","v":"Adjusted Budget"},{"$f":"Head38","v":"Monthly actual"},{"$f":"Head39","v":"YearTD actual"},{"$f":"Head40","v":"YearTD budget"},{"$f":"Head41","v":"YTD variance"},{"$f":"Head41","v":"YTD variance"},"% spend of Original Budget"]
["R thousands",null,null,null,null,null,null,null,"%"]
["Monthly expenditure performance trend"]
["July",5372009.25,9155855.5,0,0,{"$f":"IF(E6>0,E6,\"\")","v":""},{"$f":"IF(D6>0,D6,C6)","v":9155855.5},{"$f":"IF(F6=\"\",0,G6-F6)","v":0},{"$f":"IF(F6=\"\",\"\",IF(H6=0,\"\",H6/G6))","v":""},{"$f":"IF(F6=\"\",\"\",F6/$C$18)","v":""}]
["August",5372009.25,9155855.5,0,0,{"$f":"IF(E7>0,E7+F6,\"\")","v":""},{"$f":"IF(D7>0,D7+D6,C7+C6)","v":18311711},0,"",""]
["September",5372009.25,9155855.5,0,0,{"$f":"IF(E8>0,E8+F7,\"\")","v":""},{"$f":"IF(D8>0,D8+G7,C8+G7)","v":27467566.5},0,"",""]
["October",5372009.25,9155855.5,0,0,"",{"$f":"IF(D9>0,D9+G8,C9+G8)","v":36623422},0,"",""]
["November",5372009.25,9155855.5,0,0,"",45779277.5,0,"",""]
["December",5372009.25,9155855.5,0,0,"",54935133,0,"",""]
["January",5372009.25,9155855.5,0,0,"",64090988.5,0,"",""]
["February",5372009.25,9155855.5,0,0,"",73246844,0,"",""]
["March",5372009.25,9155855.5,0,0,"",82402699.5,0,"",""]
["April",5372009.25,9155855.5,0,0,"",91558555,0,"",""]
["May",5372009.25,9155855.5,0,0,"",100714410.5,0,"",""]
["June",5372009.25,9155855.5,0,0,"",109870266,{"$f":"IF(F17=\"\",0,G17-F17)","v":0},{"$f":"IF(F17=\"\",\"\",IF(H17=0,\"\",H17/G17))","v":""},{"$f":"IF(F17=\"\",\"\",F17/$C$18)","v":""}]
["Total Capital expenditure",{"$f":"SUM(B6:B17)","v":64464111},{"$f":"SUM(C6:C17)","v":109870266},{"$f":"SUM(D6:D17)","v":0},{"$f":"SUM(E6:E17)","v":0}]

{"sheet":"SC13a","index":28,"n_rows":171,"n_cols":11,"rows_kept":171,"cut":false,"hidden":false,"merged":[[1,0,2,0],[1,1,2,1],[0,0,0,10]]}
[{"$f":"muni& \" - \"&S71Sa& \" - \"&Head57","v":"LIM331 Greater Giyani - Supporting Table SC13a Monthly Budget Statement - capital expenditure on new assets by asset class - M01 July"}]
[{"$f":"desc","v":"Description"},{"$f":"head27","v":"Ref"},{"$f":"Head1","v":"2018/19"},{"$f":"Head2","v":"Budget Year 2019/20"}]
[null,null,{"$f":"Head5","v":"Audited Outcome"},{"$f":"Head6","v":"Original Budget"},{"$f":"Head7","v":"Adjusted Budget"},{"$f":"Head38","v":"Monthly actual"},{"$f":"Head39","v":"YearTD actual"},{"$f":"Head40","v":"YearTD budget"},{"$f":"Head41","v":"YTD variance"},{"$f":"Head41","v":"YTD variance"},{"$f":"Head8","v":"Full Year Forecast"}]
["R thousands",1,null,null,null,null,null,null,null,"%"]
["Capital expenditure on new assets by Asset Class/Sub-class"]
[]
["Infrastructure",null,{"$f":"C8+C13+C17+C27+C38+C45+C53+C63+C69","v":47267449},49902820,0,0,0,4158568.333333333,{"$f":"H7-G7","v":4158568.333333333},{"$f":"IF(I7=0,\"\",I7/H7)","v":1},{"$f":"K8+K13+K17+K27+K38+K45+K53+K63+K69","v":49902820}]
["Roads Infrastructure",null,{"$f":"SUM(C9:C12)","v":47267449},35002820,0,0,0,2916901.6666666665,2916901.6666666665,1,{"$f":"SUM(K9:K12)","v":35002820}]
["Roads",null,47267449,34902820,0,0,0,{"$f":"1/12*D9","v":2908568.333333333},2908568.333333333,1,34902820]
["Road Structures",null,0,100000,0,0,0,8333.3333333333321,8333.3333333333321,1,100000]
["Road Furniture",null,0,0,0,0,0,0,0,"",0]
["Capital Spares",null,0,0,0,0,0,0,0,"",0]
["Storm water Infrastructure",null,{"$f":"SUM(C14:C16)","v":0},0,0,0,0,0,0,"",{"$f":"SUM(K14:K16)","v":0}]
["Drainage Collection",null,0,0,0,0,0,0,0,"",0]
["Storm water Conveyance",null,0,0,0,0,0,0,0,"",0]
["Attenuation",null,0,0,0,0,0,0,0,"",0]
["Electrical Infrastructure",null,{"$f":"SUM(C18:C26)","v":0},0,0,0,0,0,0,"",{"$f":"SUM(K18:K26)","v":0}]
["Power Plants",null,0,0,0,0,0,{"$f":"1/12*D18","v":0},0,"",0]
["HV Substations",null,0,0,0,0,0,0,0,"",0]
["HV Switching Station",null,0,0,0,0,0,0,0,"",0]
["HV Transmission Conductors",null,0,0,0,0,0,0,0,"",0]
["MV Substations",null,0,0,0,0,0,0,0,"",0]
["MV Switching Stations",null,0,0,0,0,0,0,0,"",0]
["MV Networks",null,0,0,0,0,0,0,0,"",0]
["LV Networks",null,0,0,0,0,0,0,0,"",0]
["Capital Spares",null,0,0,0,0,0,0,0,"",0]
["Water Supply Infrastructure",null,{"$f":"SUM(C28:C37)","v":0},0,0,0,0,0,0,"",{"$f":"SUM(K28:K37)","v":0}]
["Dams and Weirs",null,0,0,0,0,0,0,0,"",0]
["Boreholes",null,0,0,0,0,0,0,0,"",0]
["Reservoirs",null,0,0,0,0,0,0,0,"",0]
["Pump Stations",null,0,0,0,0,0,0,0,"",0]
["Water Treatment Works",null,0,0,0,0,0,0,0,"",0]
["Bulk Mains",null,0,0,0,0,0,0,0,"",0]
["Distribution",null,0,0,0,0,0,0,0,"",0]
["Distribution Points",null,0,0,0,0,0,0,0,"",0]
["PRV Stations",null,0,0,0,0,0,0,0,"",0]
["Capital Spares",null,0,0,0,0,0,0,0,"",0]
["Sanitation Infrastructure",null,{"$f":"SUM(C39:C44)","v":0},0,0,0,0,0,{"$f":"H38-G38","v":0},{"$f":"IF(I38=0,\"\",I38/H38)","v":""},{"$f":"SUM(K39:K44)","v":0}]
["Pump Station",null,0,0,0,0,0,0,0,"",0]
["Reticulation",null,0,0,0,0,0,0,{"$f":"H40-G40","v":0},{"$f":"IF(I40=0,\"\",I40/H40)","v":""},0]
["Waste Water Treatment Works",null,0,0,0,0,0,0,{"$f":"H41-G41","v":0},{"$f":"IF(I41=0,\"\",I41/H41)","v":""},0]
["Outfall Sewers",null,0,0,0,0,0,0,{"$f":"H42-G42","v":0},{"$f":"IF(I42=0,\"\",I42/H42)","v":""},0]
["Toilet Facilities",null,0,0,0,0,0,0,0,"",0]
["Capital Spares",null,0,0,0,0,0,0,0,"",0]
["Solid Waste Infrastructure",null,{"$f":"SUM(C46:C52)","v":0},12500000,0,0,0,1041666.6666666666,{"$f":"H45-G45","v":1041666.6666666666},{"$f":"IF(I45=0,\"\",I45/H45)","v":1},{"$f":"SUM(K46:K52)","v":12500000}]
["Landfill Sites",null,0,12500000,0,0,0,{"$f":"1/12*D46","v":1041666.6666666666},1041666.6666666666,1,12500000]
["Waste Transfer Stations",null,0,0,0,0,0,0,0,"",0]
["Waste Processing Facilities",null,0,0,0,0,0,0,{"$f":"H48-G48","v":0},{"$f":"IF(I48=0,\"\",I48/H48)","v":""},0]
["Waste Drop-off Points",null,0,0,0,0,0,0,0,"",0]
["Waste Separation Facilities",null,0,0,0,0,0,0,0,"",0]
["Electricity Generation Facilities",null,0,0,0,0,0,0,0,"",0]
["Capital Spares",null,0,0,0,0,0,0,0,"",0]
["Rail Infrastructure",null,{"$f":"SUM(C54:C62)","v":0},0,0,0,0,0,0,"",{"$f":"SUM(K54:K62)","v":0}]
["Rail Lines",null,0,0,0,0,0,0,0,"",0]
["Rail Structures",null,0,0,0,0,0,0,0,"",0]
["Rail Furniture",null,0,0,0,0,0,0,0,"",0]
["Drainage Collection",null,0,0,0,0,0,0,0,"",0]
["Storm water Conveyance",null,0,0,0,0,0,0,0,"",0]
["Attenuation",null,0,0,0,0,0,0,0,"",0]
["MV Substations",null,0,0,0,0,0,0,0,"",0]
["LV Networks",null,0,0,0,0,0,0,0,"",0]
["Capital Spares",null,0,0,0,0,0,0,0,"",0]
["Coastal Infrastructure",null,{"$f":"SUM(C64:C68)","v":0},0,0,0,0,0,0,"",{"$f":"SUM(K64:K68)","v":0}]
["Sand Pumps",null,0,0,0,0,0,0,0,"",0]
["Piers",null,0,0,0,0,0,0,0,"",0]
["Revetments",null,0,0,0,0,0,0,0,"",0]
["Promenades",null,0,0,0,0,0,0,0,"",0]
["Capital Spares",null,0,0,0,0,0,0,0,"",0]
["Information and Communication Infrastructure",null,{"$f":"SUM(C70:C73)","v":0},2400000,0,0,0,200000,{"$f":"H69-G69","v":200000},{"$f":"IF(I69=0,\"\",I69/H69)","v":1},{"$f":"SUM(K70:K73)","v":2400000}]
["Data Centres",null,0,0,0,0,0,{"$f":"1/12*D70","v":0},{"$f":"H70-G70","v":0},"",0]
["Core Layers",null,0,2400000,0,0,0,200000,{"$f":"H71-G71","v":200000},1,2400000]
["Distribution Layers",null,0,0,0,0,0,0,{"$f":"H72-G72","v":0},"",0]
["Capital Spares",null,0,0,0,0,0,0,{"$f":"H73-G73","v":0},"",0]
[null,null,null,null,null,null,null,null,null,""]
["Community Assets",null,{"$f":"+C76+C99","v":7438669},20750780,0,0,0,1729231.6666666665,{"$f":"H75-G75","v":1729231.6666666665},1,{"$f":"+K76+K99","v":20750780}]
["Community Facilities",null,{"$f":"SUM(C77:C98)","v":0},0,0,0,0,0,{"$f":"H76-G76","v":0},{"$f":"IF(I76=0,\"\",I76/H76)","v":""},{"$f":"SUM(K77:K98)","v":0}]
["Halls",null,0,0,0,0,0,0,0,"",0]
["Centres",null,0,0,0,0,0,0,0,"",0]
["Crèches",null,0,0,0,0,0,0,0,"",0]
["Clinics/Care Centres",null,0,0,0,0,0,0,0,"",0]
["Fire/Ambulance Stations",null,0,0,0,0,0,0,0,"",0]
["Testing Stations",null,0,0,0,0,0,0,0,"",0]
["Museums",null,0,0,0,0,0,0,0,"",0]
["Galleries",null,0,0,0,0,0,0,0,"",0]
["Theatres",null,0,0,0,0,0,0,0,"",0]
["Libraries",null,0,0,0,0,0,0,0,"",0]
["Cemeteries/Crematoria",null,0,0,0,0,0,0,0,"",0]
["Police",null,0,0,0,0,0,0,{"$f":"H88-G88","v":0},{"$f":"IF(I88=0,\"\",I88/H88)","v":""},0]
["Purls",null,0,0,0,0,0,0,0,"",0]
["Public Open Space",null,0,0,0,0,0,0,0,"",0]
["Nature Reserves",null,0,0,0,0,0,0,0,"",0]
["Public Ablution Facilities",null,0,0,0,0,0,0,0,"",0]
["Markets",null,0,0,0,0,0,0,0,"",0]
["Stalls",null,0,0,0,0,0,0,0,"",0]
["Abattoirs",null,0,0,0,0,0,0,0,"",0]
["Airports",null,0,0,0,0,0,0,0,"",0]
["Taxi Ranks/Bus Terminals",null,0,0,0,0,0,0,0,"",0]
["Capital Spares",null,0,0,0,0,0,0,0,"",0]
["Sport and Recreation Facilities",null,{"$f":"SUM(C100:C102)","v":7438669},20750780,0,0,0,1729231.6666666665,1729231.6666666665,1,{"$f":"SUM(K100:K102)","v":20750780}]
["Indoor Facilities",null,0,0,0,0,0,{"$f":"1/12*D100","v":0},0,"",0]
["Outdoor Facilities",null,7438669,20750780,0,0,0,1729231.6666666665,1729231.6666666665,1,20750780]
["Capital Spares",null,0,0,0,0,0,0,0,"",0]
["Heritage assets",null,{"$f":"SUM(C104:C108)","v":0},0,0,0,0,0,0,"",{"$f":"SUM(K104:K108)","v":0}]
["Monuments",null,0,0,0,0,0,0,0,"",0]
["Historic Buildings",null,0,0,0,0,0,0,0,"",0]
["Works of Art",null,0,0,0,0,0,0,0,"",0]
["Conservation Areas",null,0,0,0,0,0,0,0,"",0]
["Other Heritage",null,null,0,0,0,0,0,0,"",0]
[null,null,null,null,null,null,null,null,0,""]
["Investment properties",null,{"$f":"+C111+C114","v":0},0,0,0,0,0,0,"",{"$f":"+K111+K114","v":0}]
["Revenue Generating",null,{"$f":"SUM(C112:C113)","v":0},0,0,0,0,0,0,"",{"$f":"SUM(K112:K113)","v":0}]
["Improved Property",null,0,0,0,0,0,0,0,"",0]
["Unimproved Property",null,0,0,0,0,0,0,0,"",0]
["Non-revenue Generating",null,{"$f":"SUM(C115:C116)","v":0},0,0,0,0,0,0,"",{"$f":"SUM(K115:K116)","v":0}]
["Improved Property",null,0,0,0,0,0,0,0,"",0]
["Unimproved Property",null,0,0,0,0,0,0,0,"",0]
["Other assets",null,{"$f":"+C118+C130","v":4511695},0,0,0,0,0,0,"",{"$f":"+K118+K130","v":0}]
["Operational Buildings",null,{"$f":"SUM(C119:C129)","v":4511695},0,0,0,0,0,0,"",{"$f":"SUM(K119:K129)","v":0}]
["Municipal Offices",null,4511695,0,0,0,0,0,0,"",0]
["Pay/Enquiry Points",null,0,0,0,0,0,0,0,{"$f":"IF(I120=0,\"\",I120/H120)","v":""},0]
["Building Plan Offices",null,0,0,0,0,0,0,0,"",0]
["Workshops",null,0,0,0,0,0,0,0,"",0]
["Yards",null,0,0,0,0,0,0,0,"",0]
["Stores",null,0,0,0,0,0,0,0,"",0]
["Laboratories",null,0,0,0,0,0,0,0,"",0]
["Training Centres",null,0,0,0,0,0,0,0,"",0]
["Manufacturing Plant",null,0,0,0,0,0,0,0,"",0]
["Depots",null,0,0,0,0,0,0,0,"",0]
["Capital Spares",null,0,0,0,0,0,0,0,"",0]
["Housing",null,{"$f":"SUM(C131:C133)","v":0},0,0,0,0,0,0,"",{"$f":"SUM(K131:K133)","v":0}]
["Staff Housing",null,0,0,0,0,0,0,0,"",0]
["Social Housing",null,0,0,0,0,0,0,0,"",0]
["Capital Spares",null,0,0,0,0,0,0,0,"",0]
[null,null,null,null,null,null,null,null,null,""]
["Biological or Cultivated Assets",null,{"$f":"SUM(C136:C136)","v":0},0,0,0,0,0,{"$f":"H135-G135","v":0},"",{"$f":"SUM(K136)","v":0}]
["Biological or Cultivated Assets",null,0,0,0,0,0,0,{"$f":"H136-G136","v":0},"",0]
[null,null,null,null,null,null,null,null,null,""]
["Intangible Assets",null,{"$f":"SUM(C139:C140)","v":2053400},1966666,0,0,0,163888.83333333331,{"$f":"H138-G138","v":163888.83333333331},1,{"$f":"SUM(K139:K140)","v":1966666}]
["Servitudes",null,0,0,0,0,0,0,0,"",0]
["Licences and Rights",null,{"$f":"SUM(C141:C146)","v":2053400},1966666,0,0,0,163888.83333333331,163888.83333333331,1,{"$f":"SUM(K141:K146)","v":1966666}]
["Water Rights",null,0,0,0,0,0,{"$f":"1/12*D141","v":0},0,"",0]
["Effluent Licenses",null,0,0,0,0,0,0,0,"",0]
["Solid Waste Licenses",null,0,0,0,0,0,0,0,"",0]
["Computer Software and Applications",null,2053400,1466666,0,0,0,122222.16666666666,122222.16666666666,1,1466666]
["Load Settlement Software Applications",null,0,0,0,0,0,0,0,"",0]
["Unspecified",null,0,500000,0,0,0,41666.666666666664,41666.666666666664,1,500000]
[]
["Computer Equipment",null,{"$f":"SUM(C149:C149)","v":0},1200000,0,0,0,100000,{"$f":"H148-G148","v":100000},{"$f":"IF(I148=0,\"\",I148/H148)","v":1},{"$f":"SUM(K149)","v":1200000}]
["Computer Equipment",null,0,1200000,0,0,0,{"$f":"1/12*D149","v":100000},{"$f":"H149-G149","v":100000},{"$f":"IF(I149=0,\"\",I149/H149)","v":1},1200000]
[]
["Furniture and Office Equipment",null,{"$f":"SUM(C152:C152)","v":163212},1300000,0,0,0,108333.33333333333,{"$f":"H151-G151","v":108333.33333333333},{"$f":"IF(I151=0,\"\",I151/H151)","v":1},{"$f":"SUM(K152)","v":1300000}]
["Furniture and Office Equipment",null,163212,1300000,0,0,0,{"$f":"1/12*D152","v":108333.33333333333},{"$f":"H152-G152","v":108333.33333333333},{"$f":"IF(I152=0,\"\",I152/H152)","v":1},1300000]
[null,null,null,null,null,null,null,null,null,{"$f":"IF(I153=0,\"\",I153/H153)","v":""}]
["Machinery and Equipment",null,{"$f":"SUM(C155:C155)","v":1724713},4200000,0,0,0,350000,{"$f":"H154-G154","v":350000},{"$f":"IF(I154=0,\"\",I154/H154)","v":1},{"$f":"SUM(K155)","v":4200000}]
["Machinery and Equipment",null,1724713,4200000,0,0,0,{"$f":"1/12*D155","v":350000},{"$f":"H155-G155","v":350000},{"$f":"IF(I155=0,\"\",I155/H155)","v":1},4200000]
[]
["Transport Assets",null,{"$f":"SUM(C158:C158)","v":1099973},1500000,0,0,0,125000,{"$f":"H157-G157","v":125000},{"$f":"IF(I157=0,\"\",I157/H157)","v":1},{"$f":"SUM(K158)","v":1500000}]
["Transport Assets",null,1099973,1500000,0,0,0,{"$f":"1/12*D158","v":125000},{"$f":"H158-G158","v":125000},{"$f":"IF(I158=0,\"\",I158/H158)","v":1},1500000]
[]
["Land",null,{"$f":"SUM(C161:C161)","v":205000},0,0,0,0,0,{"$f":"H160-G160","v":0},{"$f":"IF(I160=0,\"\",I160/H160)","v":""},{"$f":"SUM(K161)","v":0}]
["Land",null,205000,0,0,0,0,0,{"$f":"H161-G161","v":0},{"$f":"IF(I161=0,\"\",I161/H161)","v":""},0]
[]
["Zoo's, Marine and Non-biological Animals",null,{"$f":"SUM(C164:C164)","v":0},0,0,0,0,0,{"$f":"H163-G163","v":0},{"$f":"IF(I163=0,\"\",I163/H163)","v":""},{"$f":"SUM(K164)","v":0}]
["Zoo's, Marine and Non-biological Animals",null,0,0,0,0,0,0,{"$f":"H164-G164","v":0},{"$f":"IF(I164=0,\"\",I164/H164)","v":""},0]
[null,null,null,null,null,null,null,null,null,{"$f":"IF(I165=0,\"\",I165/H165)","v":""}]
["Total Capital Expenditure on new assets",1,{"$f":"C7+C75+C103+C110+C117+C135+C138+C148+C151+C154+C157+C160+C163","v":64464111},80820266,0,0,0,6735022.166666666,{"$f":"H166-G166","v":6735022.166666666},{"$f":"IF(I166=0,\"\",I166/H166)","v":1},{"$f":"K7+K75+K103+K110+K117+K135+K138+K148+K151+K154+K157+K160+K163","v":80820266}]
[]
[{"$f":"head27a","v":"References"}]
["1. Total Capital Expenditure on new assets (SC13a) plus Total Capital Expenditure on renewal of existing assets (SC13b) plus Total Capital Expenditure on upgrading of existing assets (SC13e)  must reconcile to total capital expenditure in Table C5"]
[]
["check balance",null,{"$f":"C166+SC13b!C166+SC13e!C166-'C5-Capex'!C40","v":0},{"$f":"D166+SC13b!D166+SC13e!D166-'C5-Capex'!D40","v":0},{"$f":"E166+SC13b!E166+SC13e!E166-'C5-Capex'!E40","v":0},{"$f":"F166+SC13b!F166+SC13e!F166-'C5-Capex'!F40","v":0},{"$f":"G166+SC13b!G166+SC13e!G166-'C5-Capex'!G40","v":0},{"$f":"H166+SC13b!H166+SC13e!H166-'C5-Capex'!H40","v":0},null,null,{"$f":"K166+SC13b!K166+SC13e!K166-'C5-Capex'!K40","v":0}]

{"sheet":"SC13b","index":29,"n_rows":171,"n_cols":11,"rows_kept":171,"cut":false,"hidden":false,"merged":[[0,0,0,10],[1,0,2,0],[1,1,2,1]]}
[{"$f":"muni& \" - \"&S71Sb& \" - \"&Head57","v":"LIM331 Greater Giyani - Supporting Table SC13b Monthly Budget Statement - capital expenditure on renewal of existing assets by asset class - M01 July"}]
[{"$f":"desc","v":"Description"},{"$f":"head27","v":"Ref"},{"$f":"Head1","v":"2018/19"},{"$f":"Head2","v":"Budget Year 2019/20"}]
[null,null,{"$f":"Head5","v":"Audited Outcome"},{"$f":"Head6","v":"Original Budget"},{"$f":"Head7","v":"Adjusted Budget"},{"$f":"Head38","v":"Monthly actual"},{"$f":"Head39","v":"YearTD actual"},{"$f":"Head40","v":"YearTD budget"},{"$f":"Head41","v":"YTD variance"},{"$f":"Head41","v":"YTD variance"},{"$f":"Head8","v":"Full Year Forecast"}]
["R thousands",1,null,null,null,null,null,null,null,"%"]
["Capital expenditure on renewal of existing assets by Asset Class/Sub-class"]
[]
["Infrastructure",null,{"$f":"C8+C13+C17+C27+C38+C45+C53+C63+C69","v":0},0,0,0,0,0,{"$f":"H7-G7","v":0},{"$f":"IF(I7=0,\"\",I7/H7)","v":""},{"$f":"K8+K13+K17+K27+K38+K45+K53+K63+K69","v":0}]
["Roads Infrastructure",null,{"$f":"SUM(C9:C12)","v":0},0,0,0,0,0,0,"",{"$f":"SUM(K9:K12)","v":0}]
["Roads",null,0,0,0,0,0,{"$f":"1/12*D9","v":0},0,"",0]
["Road Structures",null,0,0,0,0,0,0,0,"",0]
["Road Furniture",null,0,0,0,0,0,0,0,"",0]
["Capital Spares",null,0,0,0,0,0,0,0,"",0]
["Storm water Infrastructure",null,{"$f":"SUM(C14:C16)","v":0},0,0,0,0,0,0,"",{"$f":"SUM(K14:K16)","v":0}]
["Drainage Collection",null,0,0,0,0,0,0,0,"",0]
["Storm water Conveyance",null,0,0,0,0,0,0,0,"",0]
["Attenuation",null,0,0,0,0,0,0,0,"",0]
["Electrical Infrastructure",null,{"$f":"SUM(C18:C26)","v":0},0,0,0,0,0,0,"",{"$f":"SUM(K18:K26)","v":0}]
["Power Plants",null,0,0,0,0,0,0,0,"",0]
["HV Substations",null,0,0,0,0,0,0,0,"",0]
["HV Switching Station",null,0,0,0,0,0,0,0,"",0]
["HV Transmission Conductors",null,0,0,0,0,0,0,0,"",0]
["MV Substations",null,0,0,0,0,0,0,0,"",0]
["MV Switching Stations",null,0,0,0,0,0,0,0,"",0]
["MV Networks",null,0,0,0,0,0,0,0,"",0]
["LV Networks",null,0,0,0,0,0,0,0,"",0]
["Capital Spares",null,0,0,0,0,0,0,0,"",0]
["Water Supply Infrastructure",null,{"$f":"SUM(C28:C37)","v":0},0,0,0,0,0,0,"",{"$f":"SUM(K28:K37)","v":0}]
["Dams and Weirs",null,0,0,0,0,0,0,0,"",0]
["Boreholes",null,0,0,0,0,0,0,0,"",0]
["Reservoirs",null,0,0,0,0,0,0,0,"",0]
["Pump Stations",null,0,0,0,0,0,0,0,"",0]
["Water Treatment Works",null,0,0,0,0,0,0,0,"",0]
["Bulk Mains",null,0,0,0,0,0,0,0,"",0]
["Distribution",null,0,0,0,0,0,0,0,"",0]
["Distribution Points",null,0,0,0,0,0,0,0,"",0]
["PRV Stations",null,0,0,0,0,0,0,0,"",0]
["Capital Spares",null,0,0,0,0,0,0,0,"",0]
["Sanitation Infrastructure",null,{"$f":"SUM(C39:C44)","v":0},0,0,0,0,0,0,"",{"$f":"SUM(K39:K44)","v":0}]
["Pump Station",null,0,0,0,0,0,0,0,"",0]
["Reticulation",null,0,0,0,0,0,0,0,"",0]
["Waste Water Treatment Works",null,0,0,0,0,0,0,0,"",0]
["Outfall Sewers",null,0,0,0,0,0,0,0,"",0]
["Toilet Facilities",null,0,0,0,0,0,0,0,"",0]
["Capital Spares",null,0,0,0,0,0,0,0,"",0]
["Solid Waste Infrastructure",null,{"$f":"SUM(C46:C52)","v":0},0,0,0,0,0,0,"",{"$f":"SUM(K46:K52)","v":0}]
["Landfill Sites",null,0,0,0,0,0,0,0,"",0]
["Waste Transfer Stations",null,0,0,0,0,0,0,0,"",0]
["Waste Processing Facilities",null,0,0,0,0,0,0,0,"",0]
["Waste Drop-off Points",null,0,0,0,0,0,0,0,"",0]
["Waste Separation Facilities",null,0,0,0,0,0,0,0,"",0]
["Electricity Generation Facilities",null,0,0,0,0,0,0,0,"",0]
["Capital Spares",null,0,0,0,0,0,0,0,"",0]
["Rail Infrastructure",null,{"$f":"SUM(C54:C62)","v":0},0,0,0,0,0,0,"",{"$f":"SUM(K54:K62)","v":0}]
["Rail Lines",null,0,0,0,0,0,0,0,"",0]
["Rail Structures",null,0,0,0,0,0,0,0,"",0]
["Rail Furniture",null,0,0,0,0,0,0,0,"",0]
["Drainage Collection",null,0,0,0,0,0,0,0,"",0]
["Storm water Conveyance",null,0,0,0,0,0,0,0,"",0]
["Attenuation",null,0,0,0,0,0,0,0,"",0]
["MV Substations",null,0,0,0,0,0,0,0,"",0]
["LV Networks",null,0,0,0,0,0,0,0,"",0]
["Capital Spares",null,0,0,0,0,0,0,0,"",0]
["Coastal Infrastructure",null,{"$f":"SUM(C64:C68)","v":0},0,0,0,0,0,0,"",{"$f":"SUM(K64:K68)","v":0}]
["Sand Pumps",null,0,0,0,0,0,0,0,"",0]
["Piers",null,0,0,0,0,0,0,0,"",0]
["Revetments",null,0,0,0,0,0,0,0,"",0]
["Promenades",null,0,0,0,0,0,0,0,"",0]
["Capital Spares",null,0,0,0,0,0,0,0,"",0]
["Information and Communication Infrastructure",null,{"$f":"SUM(C70:C73)","v":0},0,0,0,0,0,0,"",{"$f":"SUM(K70:K73)","v":0}]
["Data Centres",null,0,0,0,0,0,0,0,"",0]
["Core Layers",null,0,0,0,0,0,0,0,"",0]
["Distribution Layers",null,0,0,0,0,0,0,0,"",0]
["Capital Spares",null,0,0,0,0,0,0,0,"",0]
[null,null,null,null,null,null,null,null,null,""]
["Community Assets",null,{"$f":"+C76+C99","v":0},0,0,0,0,0,0,"",{"$f":"+K76+K99","v":0}]
["Community Facilities",null,{"$f":"SUM(C77:C98)","v":0},0,0,0,0,0,0,"",{"$f":"SUM(K77:K98)","v":0}]
["Halls",null,0,0,0,0,0,{"$f":"1/12*D77","v":0},0,"",0]
["Centres",null,0,0,0,0,0,0,0,"",0]
["Crèches",null,0,0,0,0,0,0,0,"",0]
["Clinics/Care Centres",null,0,0,0,0,0,0,0,"",0]
["Fire/Ambulance Stations",null,0,0,0,0,0,0,0,"",0]
["Testing Stations",null,0,0,0,0,0,0,0,"",0]
["Museums",null,0,0,0,0,0,0,0,"",0]
["Galleries",null,0,0,0,0,0,0,0,"",0]
["Theatres",null,0,0,0,0,0,0,0,"",0]
["Libraries",null,0,0,0,0,0,0,0,"",0]
["Cemeteries/Crematoria",null,0,0,0,0,0,0,0,"",0]
["Police",null,0,0,0,0,0,0,0,"",0]
["Purls",null,0,0,0,0,0,0,0,"",0]
["Public Open Space",null,0,0,0,0,0,0,0,"",0]
["Nature Reserves",null,0,0,0,0,0,0,0,"",0]
["Public Ablution Facilities",null,0,0,0,0,0,0,0,"",0]
["Markets",null,0,0,0,0,0,0,0,"",0]
["Stalls",null,0,0,0,0,0,0,0,"",0]
["Abattoirs",null,0,0,0,0,0,0,0,"",0]
["Airports",null,0,0,0,0,0,0,0,"",0]
["Taxi Ranks/Bus Terminals",null,0,0,0,0,0,0,0,"",0]
["Capital Spares",null,0,0,0,0,0,0,0,"",0]
["Sport and Recreation Facilities",null,{"$f":"SUM(C100:C102)","v":0},0,0,0,0,0,0,"",{"$f":"SUM(K100:K102)","v":0}]
["Indoor Facilities",null,0,0,0,0,0,0,0,"",0]
["Outdoor Facilities",null,0,0,0,0,0,0,{"$f":"H101-G101","v":0},{"$f":"IF(I101=0,\"\",I101/H101)","v":""},0]
["Capital Spares",null,0,0,0,0,0,0,0,"",0]
["Heritage assets",null,{"$f":"SUM(C104:C108)","v":0},0,0,0,0,0,0,"",{"$f":"SUM(K104:K108)","v":0}]
["Monuments",null,0,0,0,0,0,0,0,"",0]
["Historic Buildings",null,0,0,0,0,0,0,0,"",0]
["Works of Art",null,0,0,0,0,0,0,0,"",0]
["Conservation Areas",null,0,0,0,0,0,0,0,"",0]
["Other Heritage",null,0,0,0,0,0,0,0,"",0]
[null,null,null,null,null,null,null,null,0,""]
["Investment properties",null,{"$f":"+C111+C114","v":0},0,0,0,0,0,0,"",{"$f":"+K111+K114","v":0}]
["Revenue Generating",null,{"$f":"SUM(C112:C113)","v":0},0,0,0,0,0,0,"",{"$f":"SUM(K112:K113)","v":0}]
["Improved Property",null,0,0,0,0,0,0,0,"",0]
["Unimproved Property",null,0,0,0,0,0,0,0,"",0]
["Non-revenue Generating",null,{"$f":"SUM(C115:C116)","v":0},0,0,0,0,0,0,"",{"$f":"SUM(K115:K116)","v":0}]
["Improved Property",null,0,0,0,0,0,0,0,"",0]
["Unimproved Property",null,0,0,0,0,0,0,{"$f":"H116-G116","v":0},{"$f":"IF(I116=0,\"\",I116/H116)","v":""},0]
["Other assets",null,{"$f":"+C118+C130","v":0},0,0,0,0,0,0,"",{"$f":"+K118+K130","v":0}]
["Operational Buildings",null,{"$f":"SUM(C119:C129)","v":0},0,0,0,0,0,0,"",{"$f":"SUM(K119:K129)","v":0}]
["Municipal Offices",null,0,0,0,0,0,0,0,"",0]
["Pay/Enquiry Points",null,0,0,0,0,0,0,0,"",0]
["Building Plan Offices",null,0,0,0,0,0,0,0,"",0]
["Workshops",null,0,0,0,0,0,0,0,"",0]
["Yards",null,0,0,0,0,0,0,0,"",0]
["Stores",null,0,0,0,0,0,0,0,"",0]
["Laboratories",null,0,0,0,0,0,0,0,"",0]
["Training Centres",null,0,0,0,0,0,0,0,"",0]
["Manufacturing Plant",null,0,0,0,0,0,0,0,"",0]
["Depots",null,0,0,0,0,0,0,0,"",0]
["Capital Spares",null,0,0,0,0,0,0,0,"",0]
["Housing",null,{"$f":"SUM(C131:C133)","v":0},0,0,0,0,0,0,"",{"$f":"SUM(K131:K133)","v":0}]
["Staff Housing",null,0,0,0,0,0,0,0,"",0]
["Social Housing",null,0,0,0,0,0,0,0,"",0]
["Capital Spares",null,0,0,0,0,0,0,0,"",0]
[null,null,null,null,null,null,null,null,null,""]
["Biological or Cultivated Assets",null,{"$f":"SUM(C136:C136)","v":0},0,0,0,0,0,{"$f":"H135-G135","v":0},"",{"$f":"SUM(K136)","v":0}]
["Biological or Cultivated Assets",null,0,0,0,0,0,0,{"$f":"H136-G136","v":0},"",0]
[null,null,null,null,null,null,null,null,null,{"$f":"IF(I137=0,\"\",I137/H137)","v":""}]
["Intangible Assets",null,{"$f":"SUM(C139:C140)","v":0},0,0,0,0,0,{"$f":"H138-G138","v":0},"",{"$f":"SUM(K139:K140)","v":0}]
["Servitudes",null,0,0,0,0,0,0,0,"",0]
["Licences and Rights",null,{"$f":"SUM(C141:C146)","v":0},0,0,0,0,0,0,"",{"$f":"SUM(K141:K146)","v":0}]
["Water Rights",null,0,0,0,0,0,0,0,"",0]
["Effluent Licenses",null,0,0,0,0,0,0,0,"",0]
["Solid Waste Licenses",null,0,0,0,0,0,0,0,"",0]
["Computer Software and Applications",null,0,0,0,0,0,0,0,"",0]
["Load Settlement Software Applications",null,0,0,0,0,0,0,0,"",0]
["Unspecified",null,0,0,0,0,0,0,0,"",0]
[]
["Computer Equipment",null,{"$f":"SUM(C149:C149)","v":0},0,0,0,0,0,{"$f":"H148-G148","v":0},{"$f":"IF(I148=0,\"\",I148/H148)","v":""},{"$f":"SUM(K149)","v":0}]
["Computer Equipment",null,0,0,0,0,0,0,{"$f":"H149-G149","v":0},{"$f":"IF(I149=0,\"\",I149/H149)","v":""},0]
[]
["Furniture and Office Equipment",null,{"$f":"SUM(C152:C152)","v":0},0,0,0,0,0,{"$f":"H151-G151","v":0},{"$f":"IF(I151=0,\"\",I151/H151)","v":""},{"$f":"SUM(K152)","v":0}]
["Furniture and Office Equipment",null,0,0,0,0,0,{"$f":"1/12*D152","v":0},{"$f":"H152-G152","v":0},{"$f":"IF(I152=0,\"\",I152/H152)","v":""},0]
[null,null,null,null,null,null,null,null,null,{"$f":"IF(I153=0,\"\",I153/H153)","v":""}]
["Machinery and Equipment",null,{"$f":"SUM(C155:C155)","v":0},0,0,0,0,0,{"$f":"H154-G154","v":0},{"$f":"IF(I154=0,\"\",I154/H154)","v":""},{"$f":"SUM(K155)","v":0}]
["Machinery and Equipment",null,0,0,0,0,0,0,{"$f":"H155-G155","v":0},{"$f":"IF(I155=0,\"\",I155/H155)","v":""},0]
[]
["Transport Assets",null,{"$f":"SUM(C158:C158)","v":0},0,0,0,0,0,{"$f":"H157-G157","v":0},{"$f":"IF(I157=0,\"\",I157/H157)","v":""},{"$f":"SUM(K158)","v":0}]
["Transport Assets",null,0,0,0,0,0,0,{"$f":"H158-G158","v":0},{"$f":"IF(I158=0,\"\",I158/H158)","v":""},0]
[]
["Land",null,{"$f":"SUM(C161:C161)","v":0},0,0,0,0,0,{"$f":"H160-G160","v":0},{"$f":"IF(I160=0,\"\",I160/H160)","v":""},{"$f":"SUM(K161)","v":0}]
["Land",null,0,0,0,0,0,0,{"$f":"H161-G161","v":0},{"$f":"IF(I161=0,\"\",I161/H161)","v":""},0]
[null,null,null,null,null,null,null,null,null,"."]
["Zoo's, Marine and Non-biological Animals",null,{"$f":"SUM(C164:C164)","v":0},0,0,0,0,0,{"$f":"H163-G163","v":0},{"$f":"IF(I163=0,\"\",I163/H163)","v":""},{"$f":"SUM(K164)","v":0}]
["Zoo's, Marine and Non-biological Animals",null,0,0,0,0,0,0,{"$f":"H164-G164","v":0},{"$f":"IF(I164=0,\"\",I164/H164)","v":""},0]
[null,null,null,null,null,null,null,null,null,{"$f":"IF(I165=0,\"\",I165/H165)","v":""}]
["Total Capital Expenditure on renewal of existing assets ",1,{"$f":"C7+C75+C103+C110+C117+C135+C138+C148+C151+C154+C157+C160+C163","v":0},0,0,0,0,0,{"$f":"H166-G166","v":0},{"$f":"IF(I166=0,\"\",I166/H166)","v":""},{"$f":"K7+K75+K103+K110+K117+K135+K138+K148+K151+K154+K157+K160+K163","v":0}]
[]
[{"$f":"head27a","v":"References"}]
["1. Total Capital Expenditure on new assets (SC13a) plus Total Capital Expenditure on renewal of existing assets (SC13b) plus Total Capital Expenditure on upgrading of existing assets (SC13e) must reconcile to total capital expenditure in Table C5"]
[]
["check balance",null,{"$f":"C166+SC13a!C166+SC13e!C166-'C5-Capex'!C40","v":0},{"$f":"D166+SC13a!D166+SC13e!D166-'C5-Capex'!D40","v":0},{"$f":"E166+SC13a!E166+SC13e!E166-'C5-Capex'!E40","v":0},{"$f":"F166+SC13a!F166+SC13e!F166-'C5-Capex'!F40","v":0},{"$f":"G166+SC13a!G166+SC13e!G166-'C5-Capex'!G40","v":0},{"$f":"H166+SC13a!H166+SC13e!H166-'C5-Capex'!H40","v":0},null,null,{"$f":"K166+SC13a!K166+SC13e!K166-'C5-Capex'!K40","v":0}]

{"sheet":"SC13c","index":30,"n_rows":166,"n_cols":11,"rows_kept":166,"cut":false,"hidden":false,"merged":[[0,0,0,10],[1,0,2,0],[1,1,2,1]]}
[{"$f":"muni& \" - \"&S71Sc& \" - \"&Head57","v":"LIM331 Greater Giyani - Supporting Table SC13c Monthly Budget Statement - expenditure on repairs and maintenance by asset class - M01 July"}]
[{"$f":"desc","v":"Description"},{"$f":"head27","v":"Ref"},{"$f":"Head1","v":"2018/19"},{"$f":"Head2","v":"Budget Year 2019/20"}]
[null,null,{"$f":"Head5","v":"Audited Outcome"},{"$f":"Head6","v":"Original Budget"},{"$f":"Head7","v":"Adjusted Budget"},{"$f":"Head38","v":"Monthly actual"},{"$f":"Head39","v":"YearTD actual"},{"$f":"Head40","v":"YearTD budget"},{"$f":"Head41","v":"YTD variance"},{"$f":"Head41","v":"YTD variance"},{"$f":"Head8","v":"Full Year Forecast"}]
["R thousands",1,null,null,null,null,null,null,null,"%"]
["Repairs and maintenance expenditure by Asset Class/Sub-class"]
[]
["Infrastructure",null,{"$f":"C8+C13+C17+C27+C38+C45+C53+C63+C69","v":3942114.58},7400000,0,26103.06,26103.06,616666.66666666663,{"$f":"H7-G7","v":590563.60666666657},{"$f":"IF(I7=0,\"\",I7/H7)","v":0.95767071351351341},{"$f":"K8+K13+K17+K27+K38+K45+K53+K63+K69","v":7400000}]
["Roads Infrastructure",null,{"$f":"SUM(C9:C12)","v":3942114.58},5000000,0,26103.06,26103.06,416666.66666666663,390563.60666666663,0.93735265599999995,{"$f":"SUM(K9:K12)","v":5000000}]
["Roads",null,3942114.58,3000000,0,0,0,{"$f":"1/12*D9","v":250000},250000,1,3000000]
["Road Structures",null,0,0,0,0,0,{"$f":"1/12*D10","v":0},0,"",0]
["Road Furniture",null,0,0,0,0,0,0,0,"",0]
["Capital Spares",null,0,2000000,0,26103.06,26103.06,166666.66666666666,140563.60666666666,0.84338164000000004,2000000]
["Storm water Infrastructure",null,{"$f":"SUM(C14:C16)","v":0},0,0,0,0,0,0,"",{"$f":"SUM(K14:K16)","v":0}]
["Drainage Collection",null,0,0,0,0,0,0,0,"",0]
["Storm water Conveyance",null,0,0,0,0,0,0,0,"",0]
["Attenuation",null,0,0,0,0,0,0,0,"",0]
["Electrical Infrastructure",null,{"$f":"SUM(C18:C26)","v":0},2000000,0,0,0,166666.66666666666,166666.66666666666,1,{"$f":"SUM(K18:K26)","v":2000000}]
["Power Plants",null,0,0,0,0,0,{"$f":"1/12*D18","v":0},0,"",0]
["HV Substations",null,0,0,0,0,0,0,0,"",0]
["HV Switching Station",null,0,0,0,0,0,0,0,"",0]
["HV Transmission Conductors",null,0,0,0,0,0,0,0,"",0]
["MV Substations",null,0,0,0,0,0,0,0,"",0]
["MV Switching Stations",null,0,0,0,0,0,0,0,"",0]
["MV Networks",null,0,0,0,0,0,0,0,"",0]
["LV Networks",null,0,0,0,0,0,0,0,"",0]
["Capital Spares",null,0,2000000,0,0,0,166666.66666666666,166666.66666666666,1,2000000]
["Water Supply Infrastructure",null,{"$f":"SUM(C28:C37)","v":0},0,0,0,0,0,0,"",{"$f":"SUM(K28:K37)","v":0}]
["Dams and Weirs",null,0,0,0,0,0,0,0,"",0]
["Boreholes",null,0,0,0,0,0,0,0,"",0]
["Reservoirs",null,0,0,0,0,0,0,0,"",0]
["Pump Stations",null,0,0,0,0,0,0,0,"",0]
["Water Treatment Works",null,0,0,0,0,0,0,0,"",0]
["Bulk Mains",null,0,0,0,0,0,0,0,"",0]
["Distribution",null,0,0,0,0,0,0,0,"",0]
["Distribution Points",null,0,0,0,0,0,0,0,"",0]
["PRV Stations",null,0,0,0,0,0,0,0,"",0]
["Capital Spares",null,0,0,0,0,0,0,0,"",0]
["Sanitation Infrastructure",null,{"$f":"SUM(C39:C44)","v":0},0,0,0,0,0,0,"",{"$f":"SUM(K39:K44)","v":0}]
["Pump Station",null,0,0,0,0,0,0,0,"",0]
["Reticulation",null,0,0,0,0,0,0,0,"",0]
["Waste Water Treatment Works",null,0,0,0,0,0,0,0,"",0]
["Outfall Sewers",null,0,0,0,0,0,0,0,"",0]
["Toilet Facilities",null,0,0,0,0,0,0,0,"",0]
["Capital Spares",null,0,0,0,0,0,0,0,"",0]
["Solid Waste Infrastructure",null,{"$f":"SUM(C46:C52)","v":0},400000,0,0,0,33333.333333333328,33333.333333333328,1,{"$f":"SUM(K46:K52)","v":400000}]
["Landfill Sites",null,0,400000,0,0,0,{"$f":"1/12*D46","v":33333.333333333328},33333.333333333328,1,400000]
["Waste Transfer Stations",null,0,0,0,0,0,0,0,"",0]
["Waste Processing Facilities",null,0,0,0,0,0,0,0,"",0]
["Waste Drop-off Points",null,0,0,0,0,0,0,0,"",0]
["Waste Separation Facilities",null,0,0,0,0,0,0,0,"",0]
["Electricity Generation Facilities",null,0,0,0,0,0,0,0,"",0]
["Capital Spares",null,0,0,0,0,0,0,0,"",0]
["Rail Infrastructure",null,{"$f":"SUM(C54:C62)","v":0},0,0,0,0,0,0,"",{"$f":"SUM(K54:K62)","v":0}]
["Rail Lines",null,0,0,0,0,0,0,0,"",0]
["Rail Structures",null,0,0,0,0,0,0,0,"",0]
["Rail Furniture",null,0,0,0,0,0,0,0,"",0]
["Drainage Collection",null,0,0,0,0,0,0,0,"",0]
["Storm water Conveyance",null,0,0,0,0,0,0,0,"",0]
["Attenuation",null,0,0,0,0,0,0,0,"",0]
["MV Substations",null,0,0,0,0,0,0,0,"",0]
["LV Networks",null,0,0,0,0,0,0,0,"",0]
["Capital Spares",null,0,0,0,0,0,0,0,"",0]
["Coastal Infrastructure",null,{"$f":"SUM(C64:C68)","v":0},0,0,0,0,0,0,"",{"$f":"SUM(K64:K68)","v":0}]
["Sand Pumps",null,0,0,0,0,0,0,0,"",0]
["Piers",null,0,0,0,0,0,0,0,"",0]
["Revetments",null,0,0,0,0,0,0,0,"",0]
["Promenades",null,0,0,0,0,0,0,0,"",0]
["Capital Spares",null,0,0,0,0,0,0,0,"",0]
["Information and Communication Infrastructure",null,{"$f":"SUM(C70:C73)","v":0},0,0,0,0,0,0,"",{"$f":"SUM(K70:K73)","v":0}]
["Data Centres",null,0,0,0,0,0,0,0,"",0]
["Core Layers",null,0,0,0,0,0,0,0,"",0]
["Distribution Layers",null,0,0,0,0,0,0,0,"",0]
["Capital Spares",null,0,0,0,0,0,0,0,"",0]
[null,null,null,null,null,null,null,null,null,""]
["Community Assets",null,{"$f":"+C76+C99","v":183436.79999999999},100000,0,0,0,8333.3333333333321,8333.3333333333321,1,{"$f":"+K76+K99","v":100000}]
["Community Facilities",null,{"$f":"SUM(C77:C98)","v":183436.79999999999},100000,0,0,0,8333.3333333333321,8333.3333333333321,1,{"$f":"SUM(K77:K98)","v":100000}]
["Halls",null,0,0,0,0,0,{"$f":"1/12*D77","v":0},0,"",0]
["Centres",null,0,0,0,0,0,0,0,"",0]
["Crèches",null,0,0,0,0,0,0,0,"",0]
["Clinics/Care Centres",null,0,0,0,0,0,0,0,"",0]
["Fire/Ambulance Stations",null,0,0,0,0,0,0,0,"",0]
["Testing Stations",null,0,0,0,0,0,0,0,"",0]
["Museums",null,0,0,0,0,0,0,0,"",0]
["Galleries",null,0,0,0,0,0,0,0,"",0]
["Theatres",null,0,0,0,0,0,0,0,"",0]
["Libraries",null,0,0,0,0,0,0,0,"",0]
["Cemeteries/Crematoria",null,183436.79999999999,100000,0,0,0,8333.3333333333321,8333.3333333333321,1,100000]
["Police",null,0,0,0,0,0,0,0,"",0]
["Purls",null,0,0,0,0,0,0,0,"",0]
["Public Open Space",null,0,0,0,0,0,0,0,"",0]
["Nature Reserves",null,0,0,0,0,0,0,0,"",0]
["Public Ablution Facilities",null,0,0,0,0,0,0,0,"",0]
["Markets",null,0,0,0,0,0,0,0,"",0]
["Stalls",null,0,0,0,0,0,0,0,"",0]
["Abattoirs",null,0,0,0,0,0,0,0,"",0]
["Airports",null,0,0,0,0,0,0,0,"",0]
["Taxi Ranks/Bus Terminals",null,0,0,0,0,0,0,0,"",0]
["Capital Spares",null,0,0,0,0,0,0,0,"",0]
["Sport and Recreation Facilities",null,{"$f":"SUM(C100:C102)","v":0},0,0,0,0,0,0,"",{"$f":"SUM(K100:K102)","v":0}]
["Indoor Facilities",null,0,0,0,0,0,0,0,"",0]
["Outdoor Facilities",null,0,0,0,0,0,0,{"$f":"H101-G101","v":0},{"$f":"IF(I101=0,\"\",I101/H101)","v":""},0]
["Capital Spares",null,0,0,0,0,0,0,0,"",0]
["Heritage assets",null,{"$f":"SUM(C104:C108)","v":0},0,0,0,0,0,0,"",{"$f":"SUM(K104:K108)","v":0}]
["Monuments",null,0,0,0,0,0,0,0,"",0]
["Historic Buildings",null,0,0,0,0,0,0,0,"",0]
["Works of Art",null,0,0,0,0,0,0,0,"",0]
["Conservation Areas",null,0,0,0,0,0,0,0,"",0]
["Other Heritage",null,0,0,0,0,0,0,0,"",0]
[null,null,null,null,null,null,null,null,0,""]
["Investment properties",null,{"$f":"+C111+C114","v":0},0,0,0,0,0,0,"",{"$f":"+K111+K114","v":0}]
["Revenue Generating",null,{"$f":"SUM(C112:C113)","v":0},0,0,0,0,0,0,"",{"$f":"SUM(K112:K113)","v":0}]
["Improved Property",null,0,0,0,0,0,0,0,"",0]
["Unimproved Property",null,0,0,0,0,0,0,0,"",0]
["Non-revenue Generating",null,{"$f":"SUM(C115:C116)","v":0},0,0,0,0,0,0,"",{"$f":"SUM(K115:K116)","v":0}]
["Improved Property",null,0,0,0,0,0,0,0,"",0]
["Unimproved Property",null,0,0,0,0,0,0,{"$f":"H116-G116","v":0},{"$f":"IF(I116=0,\"\",I116/H116)","v":""},0]
["Other assets",null,{"$f":"+C118+C130","v":0},3000000,0,239100,239100,250000,10900,4.36E-2,{"$f":"+K118+K130","v":3000000}]
["Operational Buildings",null,{"$f":"SUM(C119:C129)","v":0},3000000,0,239100,239100,250000,10900,4.36E-2,{"$f":"SUM(K119:K129)","v":3000000}]
["Municipal Offices",null,0,1500000,0,0,0,{"$f":"1/12*D119","v":125000},125000,1,1500000]
["Pay/Enquiry Points",null,0,0,0,0,0,0,0,"",0]
["Building Plan Offices",null,0,0,0,0,0,0,0,"",0]
["Workshops",null,0,0,0,0,0,0,0,"",0]
["Yards",null,0,0,0,0,0,0,0,"",0]
["Stores",null,0,0,0,0,0,0,0,"",0]
["Laboratories",null,0,0,0,0,0,0,0,"",0]
["Training Centres",null,0,0,0,0,0,0,0,"",0]
["Manufacturing Plant",null,0,0,0,0,0,0,0,"",0]
["Depots",null,0,0,0,0,0,0,0,"",0]
["Capital Spares",null,0,1500000,0,239100,239100,125000,-114100,-0.91279999999999994,1500000]
["Housing",null,{"$f":"SUM(C131:C133)","v":0},0,0,0,0,0,0,"",{"$f":"SUM(K131:K133)","v":0}]
["Staff Housing",null,0,0,0,0,0,0,0,"",0]
["Social Housing",null,0,0,0,0,0,0,0,"",0]
["Capital Spares",null,0,0,0,0,0,0,0,"",0]
[null,null,null,null,null,null,null,null,null,""]
["Biological or Cultivated Assets",null,{"$f":"SUM(C136:C136)","v":0},0,0,0,0,0,{"$f":"H135-G135","v":0},"",{"$f":"SUM(K136)","v":0}]
["Biological or Cultivated Assets",null,0,0,0,0,0,0,{"$f":"H136-G136","v":0},"",0]
[null,null,null,null,null,null,null,null,null,{"$f":"IF(I137=0,\"\",I137/H137)","v":""}]
["Intangible Assets",null,{"$f":"SUM(C139:C140)","v":0},0,0,0,0,0,{"$f":"H138-G138","v":0},"",{"$f":"SUM(K139:K140)","v":0}]
["Servitudes",null,0,0,0,0,0,0,0,"",0]
["Licences and Rights",null,{"$f":"SUM(C141:C146)","v":0},0,0,0,0,0,0,"",{"$f":"SUM(K141:K146)","v":0}]
["Water Rights",null,0,0,0,0,0,0,0,"",0]
["Effluent Licenses",null,0,0,0,0,0,0,0,"",0]
["Solid Waste Licenses",null,0,0,0,0,0,0,0,"",0]
["Computer Software and Applications",null,0,0,0,0,0,0,0,"",0]
["Load Settlement Software Applications",null,0,0,0,0,0,0,0,"",0]
["Unspecified",null,0,0,0,0,0,0,0,"",0]
[]
["Computer Equipment",null,{"$f":"SUM(C149:C149)","v":56966.78},50000,0,0,0,4166.6666666666661,{"$f":"H148-G148","v":4166.6666666666661},{"$f":"IF(I148=0,\"\",I148/H148)","v":1},{"$f":"SUM(K149)","v":50000}]
["Computer Equipment",null,56966.78,50000,0,0,0,{"$f":"1/12*D149","v":4166.6666666666661},{"$f":"H149-G149","v":4166.6666666666661},{"$f":"IF(I149=0,\"\",I149/H149)","v":1},50000]
[]
["Furniture and Office Equipment",null,{"$f":"SUM(C152:C152)","v":0},15000,0,0,0,1250,{"$f":"H151-G151","v":1250},{"$f":"IF(I151=0,\"\",I151/H151)","v":1},{"$f":"SUM(K152)","v":15000}]
["Furniture and Office Equipment",null,0,15000,0,0,0,{"$f":"1/12*D152","v":1250},{"$f":"H152-G152","v":1250},{"$f":"IF(I152=0,\"\",I152/H152)","v":1},15000]
[null,null,null,null,null,null,null,null,null,{"$f":"IF(I153=0,\"\",I153/H153)","v":""}]
["Machinery and Equipment",null,{"$f":"SUM(C155:C155)","v":292080.68},3070000,0,0,0,255833.33333333331,{"$f":"H154-G154","v":255833.33333333331},{"$f":"IF(I154=0,\"\",I154/H154)","v":1},{"$f":"SUM(K155)","v":3070000}]
["Machinery and Equipment",null,292080.68,3070000,0,0,0,{"$f":"1/12*D155","v":255833.33333333331},{"$f":"H155-G155","v":255833.33333333331},{"$f":"IF(I155=0,\"\",I155/H155)","v":1},3070000]
[]
["Transport Assets",null,{"$f":"SUM(C158:C158)","v":0},1000000,0,257414.59,257414.59,83333.333333333328,{"$f":"H157-G157","v":-174081.25666666665},{"$f":"IF(I157=0,\"\",I157/H157)","v":-2.08897508},{"$f":"SUM(K158)","v":1000000}]
["Transport Assets",null,0,1000000,0,257414.59,257414.59,{"$f":"1/12*D158","v":83333.333333333328},{"$f":"H158-G158","v":-174081.25666666665},{"$f":"IF(I158=0,\"\",I158/H158)","v":-2.08897508},1000000]
[]
["Land",null,{"$f":"SUM(C161:C161)","v":0},0,0,0,0,0,{"$f":"H160-G160","v":0},{"$f":"IF(I160=0,\"\",I160/H160)","v":""},{"$f":"SUM(K161)","v":0}]
["Land",null,0,0,0,0,0,0,{"$f":"H161-G161","v":0},{"$f":"IF(I161=0,\"\",I161/H161)","v":""},0]
[]
["Zoo's, Marine and Non-biological Animals",null,{"$f":"SUM(C164:C164)","v":0},0,0,0,0,0,{"$f":"H163-G163","v":0},{"$f":"IF(I163=0,\"\",I163/H163)","v":""},{"$f":"SUM(K164)","v":0}]
["Zoo's, Marine and Non-biological Animals",null,0,0,0,0,0,0,{"$f":"H164-G164","v":0},{"$f":"IF(I164=0,\"\",I164/H164)","v":""},0]
[null,null,null,null,null,null,null,null,null,{"$f":"IF(I165=0,\"\",I165/H165)","v":""}]
["Total Repairs and Maintenance Expenditure",1,{"$f":"C7+C75+C103+C110+C117+C135+C138+C148+C151+C154+C157+C160+C163","v":4474598.84},14635000,0,522617.65,522617.65,1219583.3333333333,696965.68333333323,0.5714785240860949,{"$f":"K7+K75+K103+K110+K117+K135+K138+K148+K151+K154+K157+K160+K163","v":14635000}]

{"sheet":"SC13d","index":31,"n_rows":166,"n_cols":11,"rows_kept":166,"cut":false,"hidden":false,"merged":[[0,0,0,10],[1,0,2,0],[1,1,2,1]]}
[{"$f":"muni& \" - \"&S71Sd& \" - \"&Head57","v":"LIM331 Greater Giyani - Supporting Table SC13d Monthly Budget Statement - depreciation by asset class - M01 July"}]
[{"$f":"desc","v":"Description"},{"$f":"head27","v":"Ref"},{"$f":"Head1","v":"2018/19"},{"$f":"Head2","v":"Budget Year 2019/20"}]
[null,null,{"$f":"Head5","v":"Audited Outcome"},{"$f":"Head6","v":"Original Budget"},{"$f":"Head7","v":"Adjusted Budget"},{"$f":"Head38","v":"Monthly actual"},{"$f":"Head39","v":"YearTD actual"},{"$f":"Head40","v":"YearTD budget"},{"$f":"Head41","v":"YTD variance"},{"$f":"Head41","v":"YTD variance"},{"$f":"Head8","v":"Full Year Forecast"}]
["R thousands",1,null,null,null,null,null,null,null,"%"]
["Depreciation by Asset Class/Sub-class"]
[]
["Infrastructure",null,{"$f":"C8+C13+C17+C27+C38+C45+C53+C63+C69","v":75507739.829999998},5000000,0,0,0,416666.67,{"$f":"H7-G7","v":416666.67},{"$f":"IF(I7=0,\"\",I7/H7)","v":1},{"$f":"K8+K13+K17+K27+K38+K45+K53+K63+K69","v":5000000}]
["Roads Infrastructure",null,{"$f":"SUM(C9:C12)","v":75507739.829999998},0,0,0,0,0,0,"",{"$f":"SUM(K9:K12)","v":0}]
["Roads",null,75507739.829999998,0,0,0,0,0,0,"",0]
["Road Structures",null,0,0,0,0,0,0,0,"",0]
["Road Furniture",null,0,0,0,0,0,0,0,"",0]
["Capital Spares",null,0,0,0,0,0,0,0,"",0]
["Storm water Infrastructure",null,{"$f":"SUM(C14:C16)","v":0},0,0,0,0,0,0,"",{"$f":"SUM(K14:K16)","v":0}]
["Drainage Collection",null,0,0,0,0,0,0,0,"",0]
["Storm water Conveyance",null,0,0,0,0,0,0,0,"",0]
["Attenuation",null,0,0,0,0,0,0,0,"",0]
["Electrical Infrastructure",null,{"$f":"SUM(C18:C26)","v":0},5000000,0,0,0,416666.67,416666.67,1,{"$f":"SUM(K18:K26)","v":5000000}]
["Power Plants",null,0,0,0,0,0,0,0,"",0]
["HV Substations",null,0,0,0,0,0,0,0,"",0]
["HV Switching Station",null,0,0,0,0,0,0,0,"",0]
["HV Transmission Conductors",null,0,0,0,0,0,0,0,"",0]
["MV Substations",null,0,0,0,0,0,0,0,"",0]
["MV Switching Stations",null,0,0,0,0,0,0,0,"",0]
["MV Networks",null,0,0,0,0,0,0,0,"",0]
["LV Networks",null,0,0,0,0,0,0,0,"",0]
["Capital Spares",null,0,5000000,0,0,0,416666.67,416666.67,1,5000000]
["Water Supply Infrastructure",null,{"$f":"SUM(C28:C37)","v":0},0,0,0,0,0,0,"",{"$f":"SUM(K28:K37)","v":0}]
["Dams and Weirs",null,0,0,0,0,0,0,0,"",0]
["Boreholes",null,0,0,0,0,0,0,0,"",0]
["Reservoirs",null,0,0,0,0,0,0,0,"",0]
["Pump Stations",null,0,0,0,0,0,0,0,"",0]
["Water Treatment Works",null,0,0,0,0,0,0,0,"",0]
["Bulk Mains",null,0,0,0,0,0,0,0,"",0]
["Distribution",null,0,0,0,0,0,0,0,"",0]
["Distribution Points",null,0,0,0,0,0,0,0,"",0]
["PRV Stations",null,0,0,0,0,0,0,0,"",0]
["Capital Spares",null,0,0,0,0,0,0,0,"",0]
["Sanitation Infrastructure",null,{"$f":"SUM(C39:C44)","v":0},0,0,0,0,0,0,"",{"$f":"SUM(K39:K44)","v":0}]
["Pump Station",null,0,0,0,0,0,0,0,"",0]
["Reticulation",null,0,0,0,0,0,0,0,"",0]
["Waste Water Treatment Works",null,0,0,0,0,0,0,0,"",0]
["Outfall Sewers",null,0,0,0,0,0,0,0,"",0]
["Toilet Facilities",null,0,0,0,0,0,0,0,"",0]
["Capital Spares",null,0,0,0,0,0,0,0,"",0]
["Solid Waste Infrastructure",null,{"$f":"SUM(C46:C52)","v":0},0,0,0,0,0,0,"",{"$f":"SUM(K46:K52)","v":0}]
["Landfill Sites",null,0,0,0,0,0,0,0,"",0]
["Waste Transfer Stations",null,0,0,0,0,0,0,0,"",0]
["Waste Processing Facilities",null,0,0,0,0,0,0,0,"",0]
["Waste Drop-off Points",null,0,0,0,0,0,0,0,"",0]
["Waste Separation Facilities",null,0,0,0,0,0,0,0,"",0]
["Electricity Generation Facilities",null,0,0,0,0,0,0,0,"",0]
["Capital Spares",null,0,0,0,0,0,0,0,"",0]
["Rail Infrastructure",null,{"$f":"SUM(C54:C62)","v":0},0,0,0,0,0,0,"",{"$f":"SUM(K54:K62)","v":0}]
["Rail Lines",null,0,0,0,0,0,0,0,"",0]
["Rail Structures",null,0,0,0,0,0,0,0,"",0]
["Rail Furniture",null,0,0,0,0,0,0,0,"",0]
["Drainage Collection",null,0,0,0,0,0,0,0,"",0]
["Storm water Conveyance",null,0,0,0,0,0,0,0,"",0]
["Attenuation",null,0,0,0,0,0,0,0,"",0]
["MV Substations",null,0,0,0,0,0,0,0,"",0]
["LV Networks",null,0,0,0,0,0,0,0,"",0]
["Capital Spares",null,0,0,0,0,0,0,0,"",0]
["Coastal Infrastructure",null,{"$f":"SUM(C64:C68)","v":0},0,0,0,0,0,0,"",{"$f":"SUM(K64:K68)","v":0}]
["Sand Pumps",null,0,0,0,0,0,0,0,"",0]
["Piers",null,0,0,0,0,0,0,0,"",0]
["Revetments",null,0,0,0,0,0,0,0,"",0]
["Promenades",null,0,0,0,0,0,0,0,"",0]
["Capital Spares",null,0,0,0,0,0,0,0,"",0]
["Information and Communication Infrastructure",null,{"$f":"SUM(C70:C73)","v":0},0,0,0,0,0,0,"",{"$f":"SUM(K70:K73)","v":0}]
["Data Centres",null,0,0,0,0,0,0,0,"",0]
["Core Layers",null,0,0,0,0,0,0,0,"",0]
["Distribution Layers",null,0,0,0,0,0,0,0,"",0]
["Capital Spares",null,0,0,0,0,0,0,0,"",0]
[null,null,null,null,null,null,null,null,null,""]
["Community Assets",null,{"$f":"+C76+C99","v":2670462.7799999998},8000000,0,0,0,666666.67000000004,666666.67000000004,1,{"$f":"+K76+K99","v":8000000}]
["Community Facilities",null,{"$f":"SUM(C77:C98)","v":2670462.7799999998},8000000,0,0,0,666666.67000000004,666666.67000000004,1,{"$f":"SUM(K77:K98)","v":8000000}]
["Halls",null,2670462.7799999998,8000000,0,0,0,666666.67000000004,666666.67000000004,1,8000000]
["Centres",null,0,0,0,0,0,0,0,"",0]
["Crèches",null,0,0,0,0,0,0,0,"",0]
["Clinics/Care Centres",null,0,0,0,0,0,0,0,"",0]
["Fire/Ambulance Stations",null,0,0,0,0,0,0,0,"",0]
["Testing Stations",null,0,0,0,0,0,0,0,"",0]
["Museums",null,0,0,0,0,0,0,0,"",0]
["Galleries",null,0,0,0,0,0,0,0,"",0]
["Theatres",null,0,0,0,0,0,0,0,"",0]
["Libraries",null,0,0,0,0,0,0,0,"",0]
["Cemeteries/Crematoria",null,0,0,0,0,0,0,0,"",0]
["Police",null,0,0,0,0,0,0,0,"",0]
["Purls",null,0,0,0,0,0,0,0,"",0]
["Public Open Space",null,0,0,0,0,0,0,0,"",0]
["Nature Reserves",null,0,0,0,0,0,0,0,"",0]
["Public Ablution Facilities",null,0,0,0,0,0,0,0,"",0]
["Markets",null,0,0,0,0,0,0,0,"",0]
["Stalls",null,0,0,0,0,0,0,0,"",0]
["Abattoirs",null,0,0,0,0,0,0,0,"",0]
["Airports",null,0,0,0,0,0,0,0,"",0]
["Taxi Ranks/Bus Terminals",null,0,0,0,0,0,0,0,"",0]
["Capital Spares",null,0,0,0,0,0,0,0,"",0]
["Sport and Recreation Facilities",null,{"$f":"SUM(C100:C102)","v":0},0,0,0,0,0,0,"",{"$f":"SUM(K100:K102)","v":0}]
["Indoor Facilities",null,0,0,0,0,0,0,0,"",0]
["Outdoor Facilities",null,0,0,0,0,0,0,{"$f":"H101-G101","v":0},{"$f":"IF(I101=0,\"\",I101/H101)","v":""},0]
["Capital Spares",null,0,0,0,0,0,0,0,"",0]
["Heritage assets",null,{"$f":"SUM(C104:C108)","v":0},0,0,0,0,0,0,"",{"$f":"SUM(K104:K108)","v":0}]
["Monuments",null,0,0,0,0,0,0,0,"",0]
["Historic Buildings",null,0,0,0,0,0,0,0,"",0]
["Works of Art",null,0,0,0,0,0,0,0,"",0]
["Conservation Areas",null,0,0,0,0,0,0,0,"",0]
["Other Heritage",null,0,0,0,0,0,0,0,"",0]
[null,null,null,null,null,null,null,null,0,""]
["Investment properties",null,{"$f":"+C111+C114","v":0},0,0,0,0,0,0,"",{"$f":"+K111+K114","v":0}]
["Revenue Generating",null,{"$f":"SUM(C112:C113)","v":0},0,0,0,0,0,0,"",{"$f":"SUM(K112:K113)","v":0}]
["Improved Property",null,0,0,0,0,0,0,0,"",0]
["Unimproved Property",null,0,0,0,0,0,0,0,"",0]
["Non-revenue Generating",null,{"$f":"SUM(C115:C116)","v":0},0,0,0,0,0,0,"",{"$f":"SUM(K115:K116)","v":0}]
["Improved Property",null,0,0,0,0,0,0,0,"",0]
["Unimproved Property",null,0,0,0,0,0,0,{"$f":"H116-G116","v":0},{"$f":"IF(I116=0,\"\",I116/H116)","v":""},0]
["Other assets",null,{"$f":"+C118+C130","v":2198517.54},2000000,0,0,0,166666.66666666666,166666.66666666666,1,{"$f":"+K118+K130","v":2000000}]
["Operational Buildings",null,{"$f":"SUM(C119:C129)","v":2198517.54},2000000,0,0,0,166666.66666666666,166666.66666666666,1,{"$f":"SUM(K119:K129)","v":2000000}]
["Municipal Offices",null,2198517.54,2000000,0,0,0,{"$f":"1/12*D119","v":166666.66666666666},166666.66666666666,1,2000000]
["Pay/Enquiry Points",null,0,0,0,0,0,0,0,"",0]
["Building Plan Offices",null,0,0,0,0,0,0,0,"",0]
["Workshops",null,0,0,0,0,0,0,0,"",0]
["Yards",null,0,0,0,0,0,0,0,"",0]
["Stores",null,0,0,0,0,0,0,0,"",0]
["Laboratories",null,0,0,0,0,0,0,0,"",0]
["Training Centres",null,0,0,0,0,0,0,0,"",0]
["Manufacturing Plant",null,0,0,0,0,0,0,0,"",0]
["Depots",null,0,0,0,0,0,0,0,"",0]
["Capital Spares",null,0,0,0,0,0,0,0,"",0]
["Housing",null,{"$f":"SUM(C131:C133)","v":0},0,0,0,0,0,0,"",{"$f":"SUM(K131:K133)","v":0}]
["Staff Housing",null,0,0,0,0,0,0,0,"",0]
["Social Housing",null,0,0,0,0,0,0,0,"",0]
["Capital Spares",null,0,0,0,0,0,0,0,"",0]
[null,null,null,null,null,null,null,null,null,""]
["Biological or Cultivated Assets",null,{"$f":"SUM(C136:C136)","v":0},0,0,0,0,0,{"$f":"H135-G135","v":0},"",{"$f":"SUM(K136)","v":0}]
["Biological or Cultivated Assets",null,0,0,0,0,0,0,{"$f":"H136-G136","v":0},"",0]
[null,null,null,null,null,null,null,null,null,{"$f":"IF(I137=0,\"\",I137/H137)","v":""}]
["Intangible Assets",null,{"$f":"SUM(C139:C140)","v":1828734.26},0,0,0,0,0,{"$f":"H138-G138","v":0},"",{"$f":"SUM(K139:K140)","v":0}]
["Servitudes",null,0,0,0,0,0,0,0,"",0]
["Licences and Rights",null,{"$f":"SUM(C141:C146)","v":1828734.26},0,0,0,0,0,0,"",{"$f":"SUM(K141:K146)","v":0}]
["Water Rights",null,0,0,0,0,0,{"$f":"1/12*D141","v":0},0,"",0]
["Effluent Licenses",null,0,0,0,0,0,0,0,"",0]
["Solid Waste Licenses",null,0,0,0,0,0,0,0,"",0]
["Computer Software and Applications",null,1828734.26,0,0,0,0,0,0,"",0]
["Load Settlement Software Applications",null,0,0,0,0,0,0,0,"",0]
["Unspecified",null,0,0,0,0,0,0,0,"",0]
[null,null,null,null,null,null,null,null,null,null,{"$f":"#REF!","v":{"$error":"#REF!"}}]
["Computer Equipment",null,{"$f":"SUM(C149:C149)","v":854042.91},2000000,0,0,0,166666.66666666666,{"$f":"H148-G148","v":166666.66666666666},{"$f":"IF(I148=0,\"\",I148/H148)","v":1},{"$f":"SUM(K149)","v":2000000}]
["Computer Equipment",null,854042.91,2000000,0,0,0,{"$f":"1/12*D149","v":166666.66666666666},{"$f":"H149-G149","v":166666.66666666666},{"$f":"IF(I149=0,\"\",I149/H149)","v":1},2000000]
[]
["Furniture and Office Equipment",null,{"$f":"SUM(C152:C152)","v":465387.03},2000000,0,0,0,166666.66666666666,{"$f":"H151-G151","v":166666.66666666666},{"$f":"IF(I151=0,\"\",I151/H151)","v":1},{"$f":"SUM(K152)","v":2000000}]
["Furniture and Office Equipment",null,465387.03,2000000,0,0,0,{"$f":"1/12*D152","v":166666.66666666666},{"$f":"H152-G152","v":166666.66666666666},{"$f":"IF(I152=0,\"\",I152/H152)","v":1},2000000]
[null,null,null,null,null,null,null,null,null,{"$f":"IF(I153=0,\"\",I153/H153)","v":""}]
["Machinery and Equipment",null,{"$f":"SUM(C155:C155)","v":1514038.19},9000000,0,0,0,750000,{"$f":"H154-G154","v":750000},{"$f":"IF(I154=0,\"\",I154/H154)","v":1},{"$f":"SUM(K155)","v":9000000}]
["Machinery and Equipment",null,1514038.19,9000000,0,0,0,{"$f":"1/12*D155","v":750000},{"$f":"H155-G155","v":750000},{"$f":"IF(I155=0,\"\",I155/H155)","v":1},9000000]
[]
["Transport Assets",null,{"$f":"SUM(C158:C158)","v":1345444.44},2000000,0,0,0,166666.66666666666,{"$f":"H157-G157","v":166666.66666666666},{"$f":"IF(I157=0,\"\",I157/H157)","v":1},{"$f":"SUM(K158)","v":2000000}]
["Transport Assets",null,1345444.44,2000000,0,0,0,{"$f":"1/12*D158","v":166666.66666666666},{"$f":"H158-G158","v":166666.66666666666},{"$f":"IF(I158=0,\"\",I158/H158)","v":1},2000000]
[]
["Land",null,{"$f":"SUM(C161:C161)","v":0},0,0,0,0,0,{"$f":"H160-G160","v":0},{"$f":"IF(I160=0,\"\",I160/H160)","v":""},{"$f":"SUM(K161)","v":0}]
["Land",null,0,0,0,0,0,0,{"$f":"H161-G161","v":0},{"$f":"IF(I161=0,\"\",I161/H161)","v":""},0]
[]
["Zoo's, Marine and Non-biological Animals",null,{"$f":"SUM(C164:C164)","v":0},0,0,0,0,0,{"$f":"H163-G163","v":0},{"$f":"IF(I163=0,\"\",I163/H163)","v":""},{"$f":"SUM(K164)","v":0}]
["Zoo's, Marine and Non-biological Animals",null,0,0,0,0,0,0,{"$f":"H164-G164","v":0},{"$f":"IF(I164=0,\"\",I164/H164)","v":""},0]
[null,null,null,null,null,null,null,null,null,{"$f":"IF(I165=0,\"\",I165/H165)","v":""}]
["Total Depreciation",1,{"$f":"C7+C75+C103+C110+C117+C135+C138+C148+C151+C154+C157+C160+C163","v":86384366.980000004},30000000,0,0,0,2500000.0066666668,2500000.0066666668,1,{"$f":"K7+K75+K103+K110+K117+K135+K138+K148+K151+K154+K157+K160+K163","v":30000000}]

{"sheet":"SC13e","index":32,"n_rows":171,"n_cols":11,"rows_kept":171,"cut":false,"hidden":false,"merged":[[0,0,0,10],[1,0,2,0],[1,1,2,1]]}
[{"$f":"muni& \" - \"&S71Se& \" - \"&Head57","v":"LIM331 Greater Giyani - Supporting Table SC13e Monthly Budget Statement - capital expenditure on upgrading of existing assets by asset class - M01 July"}]
[{"$f":"desc","v":"Description"},{"$f":"head27","v":"Ref"},{"$f":"Head1","v":"2018/19"},{"$f":"Head2","v":"Budget Year 2019/20"}]
[null,null,{"$f":"Head5","v":"Audited Outcome"},{"$f":"Head6","v":"Original Budget"},{"$f":"Head7","v":"Adjusted Budget"},{"$f":"Head38","v":"Monthly actual"},{"$f":"Head39","v":"YearTD actual"},{"$f":"Head40","v":"YearTD budget"},{"$f":"Head41","v":"YTD variance"},{"$f":"Head41","v":"YTD variance"},{"$f":"Head8","v":"Full Year Forecast"}]
["R thousands",1,null,null,null,null,null,null,null,"%"]
["Capital expenditure on upgrading of existing assets by Asset Class/Sub-class"]
[]
["Infrastructure",null,{"$f":"C8+C13+C17+C27+C38+C45+C53+C63+C69","v":0},4400000,0,0,0,366666.66666666663,{"$f":"H7-G7","v":366666.66666666663},{"$f":"IF(I7=0,\"\",I7/H7)","v":1},{"$f":"K8+K13+K17+K27+K38+K45+K53+K63+K69","v":4400000}]
["Roads Infrastructure",null,{"$f":"SUM(C9:C12)","v":0},4400000,0,0,0,366666.66666666663,366666.66666666663,1,{"$f":"SUM(K9:K12)","v":4400000}]
["Roads",null,0,3000000,0,0,0,{"$f":"1/12*D9","v":250000},250000,1,3000000]
["Road Structures",null,0,0,0,0,0,0,0,"",0]
["Road Furniture",null,0,1400000,0,0,0,116666.66666666666,116666.66666666666,1,1400000]
["Capital Spares",null,0,0,0,0,0,0,0,"",0]
["Storm water Infrastructure",null,{"$f":"SUM(C14:C16)","v":0},0,0,0,0,0,0,"",{"$f":"SUM(K14:K16)","v":0}]
["Drainage Collection",null,0,0,0,0,0,0,0,"",0]
["Storm water Conveyance",null,0,0,0,0,0,0,0,"",0]
["Attenuation",null,0,0,0,0,0,0,0,"",0]
["Electrical Infrastructure",null,{"$f":"SUM(C18:C26)","v":0},0,0,0,0,0,0,"",{"$f":"SUM(K18:K26)","v":0}]
["Power Plants",null,0,0,0,0,0,0,0,"",0]
["HV Substations",null,0,0,0,0,0,0,0,"",0]
["HV Switching Station",null,0,0,0,0,0,0,0,"",0]
["HV Transmission Conductors",null,0,0,0,0,0,0,0,"",0]
["MV Substations",null,0,0,0,0,0,0,0,"",0]
["MV Switching Stations",null,0,0,0,0,0,0,0,"",0]
["MV Networks",null,0,0,0,0,0,0,0,"",0]
["LV Networks",null,0,0,0,0,0,0,0,"",0]
["Capital Spares",null,0,0,0,0,0,0,0,"",0]
["Water Supply Infrastructure",null,{"$f":"SUM(C28:C37)","v":0},0,0,0,0,0,0,"",{"$f":"SUM(K28:K37)","v":0}]
["Dams and Weirs",null,0,0,0,0,0,0,0,"",0]
["Boreholes",null,0,0,0,0,0,0,0,"",0]
["Reservoirs",null,0,0,0,0,0,0,0,"",0]
["Pump Stations",null,0,0,0,0,0,0,0,"",0]
["Water Treatment Works",null,0,0,0,0,0,0,0,"",0]
["Bulk Mains",null,0,0,0,0,0,0,0,"",0]
["Distribution",null,0,0,0,0,0,0,0,"",0]
["Distribution Points",null,0,0,0,0,0,0,0,"",0]
["PRV Stations",null,0,0,0,0,0,0,0,"",0]
["Capital Spares",null,0,0,0,0,0,0,0,"",0]
["Sanitation Infrastructure",null,{"$f":"SUM(C39:C44)","v":0},0,0,0,0,0,0,"",{"$f":"SUM(K39:K44)","v":0}]
["Pump Station",null,0,0,0,0,0,0,0,"",0]
["Reticulation",null,0,0,0,0,0,0,0,"",0]
["Waste Water Treatment Works",null,0,0,0,0,0,0,0,"",0]
["Outfall Sewers",null,0,0,0,0,0,0,0,"",0]
["Toilet Facilities",null,0,0,0,0,0,0,0,"",0]
["Capital Spares",null,0,0,0,0,0,0,0,"",0]
["Solid Waste Infrastructure",null,{"$f":"SUM(C46:C52)","v":0},0,0,0,0,0,0,"",{"$f":"SUM(K46:K52)","v":0}]
["Landfill Sites",null,0,0,0,0,0,0,0,"",0]
["Waste Transfer Stations",null,0,0,0,0,0,0,0,"",0]
["Waste Processing Facilities",null,0,0,0,0,0,0,0,"",0]
["Waste Drop-off Points",null,0,0,0,0,0,0,0,"",0]
["Waste Separation Facilities",null,0,0,0,0,0,0,0,"",0]
["Electricity Generation Facilities",null,0,0,0,0,0,0,0,"",0]
["Capital Spares",null,0,0,0,0,0,0,0,"",0]
["Rail Infrastructure",null,{"$f":"SUM(C54:C62)","v":0},0,0,0,0,0,0,"",{"$f":"SUM(K54:K62)","v":0}]
["Rail Lines",null,0,0,0,0,0,0,0,"",0]
["Rail Structures",null,0,0,0,0,0,0,0,"",0]
["Rail Furniture",null,0,0,0,0,0,0,0,"",0]
["Drainage Collection",null,0,0,0,0,0,0,0,"",0]
["Storm water Conveyance",null,0,0,0,0,0,0,0,"",0]
["Attenuation",null,0,0,0,0,0,0,0,"",0]
["MV Substations",null,0,0,0,0,0,0,0,"",0]
["LV Networks",null,0,0,0,0,0,0,0,"",0]
["Capital Spares",null,0,0,0,0,0,0,0,"",0]
["Coastal Infrastructure",null,{"$f":"SUM(C64:C68)","v":0},0,0,0,0,0,0,"",{"$f":"SUM(K64:K68)","v":0}]
["Sand Pumps",null,0,0,0,0,0,0,0,"",0]
["Piers",null,0,0,0,0,0,0,0,"",0]
["Revetments",null,0,0,0,0,0,0,0,"",0]
["Promenades",null,0,0,0,0,0,0,0,"",0]
["Capital Spares",null,0,0,0,0,0,0,0,"",0]
["Information and Communication Infrastructure",null,{"$f":"SUM(C70:C73)","v":0},0,0,0,0,0,0,"",{"$f":"SUM(K70:K73)","v":0}]
["Data Centres",null,0,0,0,0,0,0,0,"",0]
["Core Layers",null,0,0,0,0,0,0,0,"",0]
["Distribution Layers",null,0,0,0,0,0,0,0,"",0]
["Capital Spares",null,0,0,0,0,0,0,0,"",0]
[null,null,null,null,null,null,null,null,null,""]
["Community Assets",null,{"$f":"+C76+C99","v":0},4600000,0,0,0,383333.33333333331,383333.33333333331,1,{"$f":"+K76+K99","v":4600000}]
["Community Facilities",null,{"$f":"SUM(C77:C98)","v":0},100000,0,0,0,8333.3333333333321,8333.3333333333321,1,{"$f":"SUM(K77:K98)","v":100000}]
["Halls",null,0,0,0,0,0,{"$f":"1/12*D77","v":0},0,"",0]
["Centres",null,0,100000,0,0,0,8333.3333333333321,8333.3333333333321,1,100000]
["Crèches",null,0,0,0,0,0,0,0,"",0]
["Clinics/Care Centres",null,0,0,0,0,0,0,0,"",0]
["Fire/Ambulance Stations",null,0,0,0,0,0,0,0,"",0]
["Testing Stations",null,0,0,0,0,0,0,0,"",0]
["Museums",null,0,0,0,0,0,0,0,"",0]
["Galleries",null,0,0,0,0,0,0,0,"",0]
["Theatres",null,0,0,0,0,0,0,0,"",0]
["Libraries",null,0,0,0,0,0,0,0,"",0]
["Cemeteries/Crematoria",null,0,0,0,0,0,0,0,"",0]
["Police",null,0,0,0,0,0,0,0,"",0]
["Purls",null,0,0,0,0,0,0,0,"",0]
["Public Open Space",null,0,0,0,0,0,0,0,"",0]
["Nature Reserves",null,0,0,0,0,0,0,0,"",0]
["Public Ablution Facilities",null,0,0,0,0,0,0,0,"",0]
["Markets",null,0,0,0,0,0,0,0,"",0]
["Stalls",null,0,0,0,0,0,0,0,"",0]
["Abattoirs",null,0,0,0,0,0,0,0,"",0]
["Airports",null,0,0,0,0,0,0,0,"",0]
["Taxi Ranks/Bus Terminals",null,0,0,0,0,0,0,0,"",0]
["Capital Spares",null,0,0,0,0,0,0,0,"",0]
["Sport and Recreation Facilities",null,{"$f":"SUM(C100:C102)","v":0},4500000,0,0,0,375000,375000,1,{"$f":"SUM(K100:K102)","v":4500000}]
["Indoor Facilities",null,0,0,0,0,0,{"$f":"1/12*D100","v":0},0,"",0]
["Outdoor Facilities",null,0,4500000,0,0,0,375000,{"$f":"H101-G101","v":375000},{"$f":"IF(I101=0,\"\",I101/H101)","v":1},4500000]
["Capital Spares",null,0,0,0,0,0,0,0,"",0]
["Heritage assets",null,{"$f":"SUM(C104:C108)","v":0},0,0,0,0,0,0,"",{"$f":"SUM(K104:K108)","v":0}]
["Monuments",null,0,0,0,0,0,0,0,"",0]
["Historic Buildings",null,0,0,0,0,0,0,0,"",0]
["Works of Art",null,0,0,0,0,0,0,0,"",0]
["Conservation Areas",null,0,0,0,0,0,0,0,"",0]
["Other Heritage",null,0,0,0,0,0,0,0,"",0]
[null,null,null,null,null,null,null,null,0,""]
["Investment properties",null,{"$f":"+C111+C114","v":0},0,0,0,0,0,0,"",{"$f":"+K111+K114","v":0}]
["Revenue Generating",null,{"$f":"SUM(C112:C113)","v":0},0,0,0,0,0,0,"",{"$f":"SUM(K112:K113)","v":0}]
["Improved Property",null,0,0,0,0,0,0,0,"",0]
["Unimproved Property",null,0,0,0,0,0,0,0,"",0]
["Non-revenue Generating",null,{"$f":"SUM(C115:C116)","v":0},0,0,0,0,0,0,"",{"$f":"SUM(K115:K116)","v":0}]
["Improved Property",null,0,0,0,0,0,0,0,"",0]
["Unimproved Property",null,0,0,0,0,0,0,{"$f":"H116-G116","v":0},{"$f":"IF(I116=0,\"\",I116/H116)","v":""},0]
["Other assets",null,{"$f":"+C118+C130","v":0},20050000,0,0,0,1670833.3333333333,1670833.3333333333,1,{"$f":"+K118+K130","v":20050000}]
["Operational Buildings",null,{"$f":"SUM(C119:C129)","v":0},20050000,0,0,0,1670833.3333333333,1670833.3333333333,1,{"$f":"SUM(K119:K129)","v":20050000}]
["Municipal Offices",null,0,20000000,0,0,0,{"$f":"1/12*D119","v":1666666.6666666665},1666666.6666666665,1,20000000]
["Pay/Enquiry Points",null,0,0,0,0,0,0,0,"",0]
["Building Plan Offices",null,0,0,0,0,0,0,0,"",0]
["Workshops",null,0,0,0,0,0,0,0,"",0]
["Yards",null,0,50000,0,0,0,4166.6666666666661,4166.6666666666661,1,50000]
["Stores",null,0,0,0,0,0,0,0,"",0]
["Laboratories",null,0,0,0,0,0,0,0,"",0]
["Training Centres",null,0,0,0,0,0,0,0,"",0]
["Manufacturing Plant",null,0,0,0,0,0,0,0,"",0]
["Depots",null,0,0,0,0,0,0,0,"",0]
["Capital Spares",null,0,0,0,0,0,0,0,"",0]
["Housing",null,{"$f":"SUM(C131:C133)","v":0},0,0,0,0,0,0,"",{"$f":"SUM(K131:K133)","v":0}]
["Staff Housing",null,0,0,0,0,0,0,0,"",0]
["Social Housing",null,0,0,0,0,0,0,0,"",0]
["Capital Spares",null,0,0,0,0,0,0,0,"",0]
[null,null,null,null,null,null,null,null,null,""]
["Biological or Cultivated Assets",null,{"$f":"SUM(C136:C136)","v":0},0,0,0,0,0,{"$f":"H135-G135","v":0},"",{"$f":"SUM(K136)","v":0}]
["Biological or Cultivated Assets",null,0,0,0,0,0,0,{"$f":"H136-G136","v":0},"",0]
[null,null,null,null,null,null,null,null,null,{"$f":"IF(I137=0,\"\",I137/H137)","v":""}]
["Intangible Assets",null,{"$f":"SUM(C139:C140)","v":0},0,0,0,0,0,{"$f":"H138-G138","v":0},"",{"$f":"SUM(K139:K140)","v":0}]
["Servitudes",null,0,0,0,0,0,0,0,"",0]
["Licences and Rights",null,{"$f":"SUM(C141:C146)","v":0},0,0,0,0,0,0,"",{"$f":"SUM(K141:K146)","v":0}]
["Water Rights",null,0,0,0,0,0,0,0,"",0]
["Effluent Licenses",null,0,0,0,0,0,0,0,"",0]
["Solid Waste Licenses",null,0,0,0,0,0,0,0,"",0]
["Computer Software and Applications",null,0,0,0,0,0,0,0,"",0]
["Load Settlement Software Applications",null,0,0,0,0,0,0,0,"",0]
["Unspecified",null,0,0,0,0,0,0,0,"",0]
[]
["Computer Equipment",null,{"$f":"SUM(C149:C149)","v":0},0,0,0,0,0,{"$f":"H148-G148","v":0},{"$f":"IF(I148=0,\"\",I148/H148)","v":""},{"$f":"SUM(K149)","v":0}]
["Computer Equipment",null,0,0,0,0,0,0,{"$f":"H149-G149","v":0},{"$f":"IF(I149=0,\"\",I149/H149)","v":""},0]
[]
["Furniture and Office Equipment",null,{"$f":"SUM(C152:C152)","v":0},0,0,0,0,0,{"$f":"H151-G151","v":0},{"$f":"IF(I151=0,\"\",I151/H151)","v":""},{"$f":"SUM(K152)","v":0}]
["Furniture and Office Equipment",null,0,0,0,0,0,0,{"$f":"H152-G152","v":0},{"$f":"IF(I152=0,\"\",I152/H152)","v":""},0]
[null,null,null,null,null,null,null,null,null,{"$f":"IF(I153=0,\"\",I153/H153)","v":""}]
["Machinery and Equipment",null,{"$f":"SUM(C155:C155)","v":0},0,0,0,0,0,{"$f":"H154-G154","v":0},{"$f":"IF(I154=0,\"\",I154/H154)","v":""},{"$f":"SUM(K155)","v":0}]
["Machinery and Equipment",null,0,0,0,0,0,0,{"$f":"H155-G155","v":0},{"$f":"IF(I155=0,\"\",I155/H155)","v":""},0]
[]
["Transport Assets",null,{"$f":"SUM(C158:C158)","v":0},0,0,0,0,0,{"$f":"H157-G157","v":0},{"$f":"IF(I157=0,\"\",I157/H157)","v":""},{"$f":"SUM(K158)","v":0}]
["Transport Assets",null,0,0,0,0,0,0,{"$f":"H158-G158","v":0},{"$f":"IF(I158=0,\"\",I158/H158)","v":""},0]
[]
["Land",null,{"$f":"SUM(C161:C161)","v":0},0,0,0,0,0,{"$f":"H160-G160","v":0},{"$f":"IF(I160=0,\"\",I160/H160)","v":""},{"$f":"SUM(K161)","v":0}]
["Land",null,0,0,0,0,0,0,{"$f":"H161-G161","v":0},{"$f":"IF(I161=0,\"\",I161/H161)","v":""},0]
[null,null,null,null,null,null,null,null,null,"."]
["Zoo's, Marine and Non-biological Animals",null,{"$f":"SUM(C164:C164)","v":0},0,0,0,0,0,{"$f":"H163-G163","v":0},{"$f":"IF(I163=0,\"\",I163/H163)","v":""},{"$f":"SUM(K164)","v":0}]
["Zoo's, Marine and Non-biological Animals",null,0,0,0,0,0,0,{"$f":"H164-G164","v":0},{"$f":"IF(I164=0,\"\",I164/H164)","v":""},0]
[null,null,null,null,null,null,null,null,null,{"$f":"IF(I165=0,\"\",I165/H165)","v":""}]
["Total Capital Expenditure on upgrading of existing assets ",1,{"$f":"C7+C75+C103+C110+C117+C135+C138+C148+C151+C154+C157+C160+C163","v":0},29050000,0,0,0,2420833.333333333,{"$f":"H166-G166","v":2420833.333333333},{"$f":"IF(I166=0,\"\",I166/H166)","v":1},{"$f":"K7+K75+K103+K110+K117+K135+K138+K148+K151+K154+K157+K160+K163","v":29050000}]
[]
[{"$f":"head27a","v":"References"}]
["1. Total Capital Expenditure on new assets (SC13a) plus Total Capital Expenditure on renewal of existing assets (SC13b) plus Total Capital Expenditure on upgrading of existing assets (SC13e)  must reconcile to total capital expenditure in Table C5"]
[]
["check balance",null,{"$f":"C166+SC13a!C166+SC13b!C166-'C5-Capex'!C40","v":0},{"$f":"D166+SC13a!D166+SC13b!D166-'C5-Capex'!D40","v":0},{"$f":"E166+SC13a!E166+SC13b!E166-'C5-Capex'!E40","v":0},{"$f":"F166+SC13a!F166+SC13b!F166-'C5-Capex'!F40","v":0},{"$f":"G166+SC13a!G166+SC13b!G166-'C5-Capex'!G40","v":0},{"$f":"H166+SC13a!H166+SC13b!H166-'C5-Capex'!H40","v":0},null,null,{"$f":"K166+SC13a!K166+SC13b!K166-'C5-Capex'!K40","v":0}]

{"sheet":"SC71charts","index":33,"n_rows":104,"n_cols":10,"rows_kept":104,"cut":false,"hidden":false,"merged":[]}
[{"$f":"'Template names'!B102","v":"Chart C1 2019/20 Capital Expenditure Monthly Trend: actual v target"}]
["Month",{"$f":"'SC12'!B2","v":"2018/19"},{"$f":"'SC12'!C3","v":"Original Budget"},{"$f":"'SC12'!D3","v":"Adjusted Budget"},{"$f":"'SC12'!E3","v":"Monthly actual"}]
[{"$f":"LEFT('SC12'!A6,3)","v":"Jul"},{"$f":"'SC12'!B6","v":5372009.25},{"$f":"'SC12'!C6","v":9155855.5},{"$f":"'SC12'!D6","v":0},{"$f":"'SC12'!E6","v":0}]
[{"$f":"LEFT('SC12'!A7,3)","v":"Aug"},{"$f":"'SC12'!B7","v":5372009.25},{"$f":"'SC12'!C7","v":9155855.5},{"$f":"'SC12'!D7","v":0},{"$f":"'SC12'!E7","v":0}]
[{"$f":"LEFT('SC12'!A8,3)","v":"Sep"},{"$f":"'SC12'!B8","v":5372009.25},{"$f":"'SC12'!C8","v":9155855.5},{"$f":"'SC12'!D8","v":0},{"$f":"'SC12'!E8","v":0}]
[{"$f":"LEFT('SC12'!A9,3)","v":"Oct"},{"$f":"'SC12'!B9","v":5372009.25},{"$f":"'SC12'!C9","v":9155855.5},{"$f":"'SC12'!D9","v":0},{"$f":"'SC12'!E9","v":0}]
[{"$f":"LEFT('SC12'!A10,3)","v":"Nov"},{"$f":"'SC12'!B10","v":5372009.25},{"$f":"'SC12'!C10","v":9155855.5},{"$f":"'SC12'!D10","v":0},{"$f":"'SC12'!E10","v":0}]
[{"$f":"LEFT('SC12'!A11,3)","v":"Dec"},{"$f":"'SC12'!B11","v":5372009.25},{"$f":"'SC12'!C11","v":9155855.5},{"$f":"'SC12'!D11","v":0},{"$f":"'SC12'!E11","v":0}]
[{"$f":"LEFT('SC12'!A12,3)","v":"Jan"},{"$f":"'SC12'!B12","v":5372009.25},{"$f":"'SC12'!C12","v":9155855.5},{"$f":"'SC12'!D12","v":0},{"$f":"'SC12'!E12","v":0}]
[{"$f":"LEFT('SC12'!A13,3)","v":"Feb"},{"$f":"'SC12'!B13","v":5372009.25},{"$f":"'SC12'!C13","v":9155855.5},{"$f":"'SC12'!D13","v":0},{"$f":"'SC12'!E13","v":0}]
[{"$f":"LEFT('SC12'!A14,3)","v":"Mar"},{"$f":"'SC12'!B14","v":5372009.25},{"$f":"'SC12'!C14","v":9155855.5},{"$f":"'SC12'!D14","v":0},{"$f":"'SC12'!E14","v":0}]
[{"$f":"LEFT('SC12'!A15,3)","v":"Apr"},{"$f":"'SC12'!B15","v":5372009.25},{"$f":"'SC12'!C15","v":9155855.5},{"$f":"'SC12'!D15","v":0},{"$f":"'SC12'!E15","v":0}]
[{"$f":"LEFT('SC12'!A16,3)","v":"May"},{"$f":"'SC12'!B16","v":5372009.25},{"$f":"'SC12'!C16","v":9155855.5},{"$f":"'SC12'!D16","v":0},{"$f":"'SC12'!E16","v":0}]
[{"$f":"LEFT('SC12'!A17,3)","v":"Jun"},{"$f":"'SC12'!B17","v":5372009.25},{"$f":"'SC12'!C17","v":9155855.5},{"$f":"'SC12'!D17","v":0},{"$f":"'SC12'!E17","v":0}]
[]
[]
[]
[]
[]
[]
[]
[]
[]
[]
[]
[{"$f":"'Template names'!B103","v":"Chart C2 2019/20 Capital Expenditure: YTD actual v YTD target"}]
["Month",{"$f":"'SC12'!F3","v":"YearTD actual"},{"$f":"'SC12'!G3","v":"YearTD budget"}]
[{"$f":"LEFT('SC12'!A6,3)","v":"Jul"},{"$f":"'SC12'!F6","v":""},{"$f":"'SC12'!G6","v":9155855.5}]
[{"$f":"LEFT('SC12'!A7,3)","v":"Aug"},{"$f":"'SC12'!F7","v":""},{"$f":"'SC12'!G7","v":18311711}]
[{"$f":"LEFT('SC12'!A8,3)","v":"Sep"},{"$f":"'SC12'!F8","v":""},{"$f":"'SC12'!G8","v":27467566.5}]
[{"$f":"LEFT('SC12'!A9,3)","v":"Oct"},{"$f":"'SC12'!F9","v":""},{"$f":"'SC12'!G9","v":36623422}]
[{"$f":"LEFT('SC12'!A10,3)","v":"Nov"},{"$f":"'SC12'!F10","v":""},{"$f":"'SC12'!G10","v":45779277.5}]
[{"$f":"LEFT('SC12'!A11,3)","v":"Dec"},{"$f":"'SC12'!F11","v":""},{"$f":"'SC12'!G11","v":54935133}]
[{"$f":"LEFT('SC12'!A12,3)","v":"Jan"},{"$f":"'SC12'!F12","v":""},{"$f":"'SC12'!G12","v":64090988.5}]
[{"$f":"LEFT('SC12'!A13,3)","v":"Feb"},{"$f":"'SC12'!F13","v":""},{"$f":"'SC12'!G13","v":73246844}]
[{"$f":"LEFT('SC12'!A14,3)","v":"Mar"},{"$f":"'SC12'!F14","v":""},{"$f":"'SC12'!G14","v":82402699.5}]
[{"$f":"LEFT('SC12'!A15,3)","v":"Apr"},{"$f":"'SC12'!F15","v":""},{"$f":"'SC12'!G15","v":91558555}]
[{"$f":"LEFT('SC12'!A16,3)","v":"May"},{"$f":"'SC12'!F16","v":""},{"$f":"'SC12'!G16","v":100714410.5}]
[{"$f":"LEFT('SC12'!A17,3)","v":"Jun"},{"$f":"'SC12'!F17","v":""},{"$f":"'SC12'!G17","v":109870266}]
[]
[]
[]
[]
[]
[]
[]
[]
[]
[]
[]
[{"$f":"'Template names'!B104","v":"Chart C3 Aged Consumer Debtors Analysis"}]
[null,{"$f":"'SC3'!C3","v":"0-30 Days"},{"$f":"'SC3'!D3","v":"31-60 Days"},{"$f":"'SC3'!E3","v":"61-90 Days"},{"$f":"'SC3'!F3","v":"91-120 Days"},{"$f":"'SC3'!G3","v":"121-150 Dys"},{"$f":"'SC3'!H3","v":"151-180 Dys"},{"$f":"'SC3'!I3","v":"181 Dys-1 Yr"},{"$f":"'SC3'!J3","v":"Over 1Yr"}]
[{"$f":"Head2","v":"Budget Year 2019/20"},{"$f":"'SC3'!C14","v":5591591.4400000107},{"$f":"'SC3'!D14","v":4686571.1900000321},{"$f":"'SC3'!E14","v":4673757.3000000324},{"$f":"'SC3'!F14","v":4418973.150000033},{"$f":"'SC3'!G14","v":4527457.1600000337},{"$f":"'SC3'!H14","v":4264799.2600000305},{"$f":"'SC3'!I14","v":30124956.910000097},{"$f":"'SC3'!J14","v":166991783.58000076}]
[{"$f":"Head1","v":"2018/19"},{"$f":"'SC3'!C15","v":0},{"$f":"'SC3'!D15","v":0},{"$f":"'SC3'!E15","v":0},{"$f":"'SC3'!F15","v":0},{"$f":"'SC3'!G15","v":0},{"$f":"'SC3'!H15","v":0},{"$f":"'SC3'!I15","v":0},{"$f":"'SC3'!J15","v":0}]
[]
[]
[]
[]
[]
[]
[]
[]
[]
[]
[]
[]
[]
[]
[]
[]
[]
[]
[]
[]
[]
[{"$f":"'Template names'!B105","v":"Chart C4 Consumer Debtors (total by Debtor Customer Category)"}]
[null,{"$f":"Head1","v":"2018/19"},{"$f":"Head2","v":"Budget Year 2019/20"}]
[{"$f":"'SC3'!A17","v":"Organs of State"},{"$f":"C78*0.97","v":61615790.979999997},{"$f":"'SC3'!K17","v":63521434}]
[{"$f":"'SC3'!A18","v":"Commercial"},{"$f":"C79*0.97","v":30434326.18},{"$f":"'SC3'!K18","v":31375594}]
[{"$f":"'SC3'!A19","v":"Households"},{"$f":"C80*0.97","v":126471375.17},{"$f":"'SC3'!K19","v":130382861}]
[{"$f":"'SC3'!A20","v":"Other"},{"$f":"C81*0.97","v":0},{"$f":"'SC3'!K20","v":0}]
[]
[]
[]
[]
[]
[]
[]
[]
[]
[]
[]
[]
[]
[]
[]
[]
[]
[]
[]
[{"$f":"'Template names'!B106","v":"Chart C5 Aged Creditors Analysis"}]
[null,{"$f":"'SC4'!A6","v":"Bulk Electricity"},{"$f":"'SC4'!A7","v":"Bulk Water"},{"$f":"'SC4'!A8","v":"PAYE deductions"},{"$f":"'SC4'!A9","v":"VAT (output less input)"},{"$f":"'SC4'!A10","v":"Pensions / Retirement deductions"},{"$f":"'SC4'!A11","v":"Loan repayments"},{"$f":"'SC4'!A12","v":"Trade Creditors"},{"$f":"'SC4'!A13","v":"Auditor General"},{"$f":"'SC4'!A14","v":"Other"}]
[{"$f":"A54","v":"2018/19"},{"$f":"'SC4'!L6","v":0},{"$f":"'SC4'!L7","v":0},{"$f":"'SC4'!L8","v":0},{"$f":"'SC4'!L9","v":0},{"$f":"'SC4'!L10","v":0},{"$f":"'SC4'!L11","v":0},{"$f":"'SC4'!L12","v":0},{"$f":"'SC4'!L13","v":0},{"$f":"'SC4'!L14","v":0}]
[{"$f":"A53","v":"Budget Year 2019/20"},{"$f":"'SC4'!K6","v":0},{"$f":"'SC4'!K7","v":0},{"$f":"'SC4'!K8","v":0},{"$f":"'SC4'!K9","v":0},{"$f":"'SC4'!K10","v":0},{"$f":"'SC4'!K11","v":0},{"$f":"'SC4'!K12","v":1026892},{"$f":"'SC4'!K13","v":0},{"$f":"'SC4'!K14","v":699504}]